program: Gaussian 09
title: 000054048
version: EM64L-G09RevD.01
frameworkgroup: C1[X(C11H22FN2O3PS2)]
method: RPBEPBE
basis: SDD
operation: Freq
keyword: #p
keyword: freq=noraman
keyword: PBEPBE/SDD
title: #p freq=noraman PBEPBE/SDD
converged: NO YES NO NO
title: Mulliken charges:
elementType: S S P F O O O N N C C C C C C C C C C C H H H H H H H H H H H H H H H H H H H H H H
charge: 0.576392 -0.218453 0.899807 -0.198662 -0.470690 -0.437917 -0.242372 -0.876478 -0.457789 0.266168 -0.356194 -0.362426 0.351379 -0.680700 -0.718808 -0.673762 -0.655837 -0.707204 -0.567858 0.401096 0.251776 0.239133 0.237326 0.237725 0.245126 0.202926 0.223396 0.218527 0.227428 0.221797 0.224336 0.221011 0.218454 0.248877 0.211229 0.214236 0.258492 0.219033 0.247824 0.238856 0.269763 0.253037
chargesum: 0.00000
title: Mulliken charges with hydrogens summed into heavy atoms:
elementType: S S P F O O O N N C C C C C C C C C C C
charge: 0.576392 -0.218453 0.899807 -0.198662 -0.470690 -0.437917 -0.242372 -0.876478 -0.457789 0.266168 0.134715 0.112625 0.351379 -0.009254 -0.051056 -0.009961 0.018505 0.018145 0.193798 0.401096
polarizability: 2.23189389e+02 1.31988774e+01 2.21900647e+02 1.57174633e+00 1.68803050e+01 1.68252740e+02
1716.lowfreq: -13.0220 -7.3887 0.0015 0.0022 0.0022 10.8346 22.7679 37.8756 47.3984
frequency: 22.1744 37.8486 47.2201 57.9969 62.0443 86.5717 104.5072 112.0140 122.5167 138.7333 149.9337 160.3902 163.5544 177.0103 207.8429 215.1520 220.5565 222.9501 229.9423 257.6007 266.8794 275.1620 285.2460 289.4963 309.8358 320.4021 328.7580 336.7052 358.2142 369.1594 391.4366 396.3972 411.9372 423.2981 436.0891 441.3537 457.6098 495.2761 504.5376 548.5984 598.1032 614.9891 643.1927 668.4054 682.9910 757.0621 764.5893 800.7424 873.7113 879.1140 901.8740 908.0982 911.4943 919.7417 924.4655 933.7569 941.0932 946.4703 954.0711 1019.7467 1022.2067 1026.3103 1029.1630 1040.8256 1119.0632 1136.0955 1169.8777 1182.9363 1188.7006 1192.7467 1237.5555 1247.9121 1271.9469 1295.7143 1301.8561 1325.4603 1351.1140 1371.2657 1379.3473 1382.1563 1399.9833 1405.3769 1417.2012 1444.5401 1450.8228 1451.9817 1459.9357 1463.8257 1464.6201 1469.6372 1470.8544 1474.8296 1478.9228 1481.1322 1485.8130 1489.9813 1501.2136 1708.9566 2974.7865 2977.9271 2978.7860 2984.2458 2988.5468 2990.3385 2994.6233 2997.4829 3069.7439 3076.0957 3076.5708 3078.7639 3083.6064 3085.4392 3088.1551 3092.2456 3093.6869 3094.9811 3101.7589 3105.1913 3109.6986 3124.2667
redmass: 5.2244 4.1898 3.9016 5.1711 5.7945 4.2675 4.5994 6.4378 5.5712 4.7895 1.1596 5.8132 3.6308 1.0594 3.5806 1.5465 1.0881 6.0983 2.2926 2.7041 2.1043 1.2541 1.5102 3.5922 3.0714 2.2042 4.0207 4.9673 2.9445 3.7235 2.4996 2.0465 3.9058 3.9555 3.8729 4.8196 5.2831 3.8210 7.7675 5.2589 6.2600 9.2538 10.2988 11.7223 11.3453 3.8336 5.0632 4.9061 4.3912 3.6861 2.4167 2.4358 2.5320 2.1424 1.7693 1.4579 1.5533 3.3791 1.2865 1.3872 1.7556 1.4592 3.6356 1.7308 1.4788 1.6728 1.9920 2.1478 1.7636 1.3193 3.0346 3.3134 2.1876 4.8283 1.9393 1.1773 1.2806 1.2072 1.1936 1.1929 1.1936 1.1929 1.1478 1.0764 1.0495 1.0720 1.0529 1.0483 1.0478 1.0560 1.0604 1.0552 1.0523 1.0555 1.0601 1.0509 1.0527 11.2621 1.0375 1.0353 1.0626 1.0560 1.0442 1.0358 1.0350 1.0340 1.0994 1.0996 1.0998 1.0997 1.0994 1.1005 1.1005 1.1012 1.0989 1.1012 1.0983 1.1009 1.1003 1.1017
irintensity: 0.9002 1.1095 0.2316 3.5065 2.3053 0.9983 1.3730 1.6077 4.9162 2.6909 0.7700 0.6120 2.4709 0.2795 0.5488 0.4601 0.0745 1.1949 2.9033 2.5638 3.8746 1.4435 0.9952 5.1649 3.0388 2.4240 11.4966 3.5689 2.7497 6.4098 0.9186 3.7895 23.9907 3.8954 6.8366 7.5001 9.3863 22.0613 14.4952 5.6840 47.2195 3.4523 80.7285 48.1527 102.1177 6.7682 70.9803 115.2220 34.5697 9.0015 13.3347 43.2187 78.1184 82.9488 39.2636 16.0953 7.3443 63.2694 0.8215 0.8341 17.7296 14.2476 85.6598 27.8507 30.8328 31.7961 0.3578 118.2092 1.7632 1.4972 20.1392 10.1628 0.4968 138.1879 15.8270 3.1256 1.4541 20.4676 21.9184 32.4691 13.9820 31.9588 33.4808 8.6261 1.4254 3.0012 20.5053 4.6564 5.6389 16.9111 10.7601 15.0536 16.2795 18.4103 13.7495 25.6254 20.6030 457.2921 15.3868 20.5158 25.4693 50.5008 21.6909 14.1848 4.1201 40.0556 20.6452 4.7094 19.1389 19.5981 6.2207 35.7184 11.4988 21.9180 44.2015 10.0408 28.1410 17.0288 23.5912 2.4806
temp: 298.150 k
press: 1.00000 atm
elementType: 16 16 15 9 8 8 8 7 7 6 6 6 6 6 6 6 6 6 6 6 1 1 1 1 1 1 1 1 1 1 1 1 1 1 1 1 1 1 1 1 1 1
symmnumber: 1
zpe: 867564.7 jmol-1
zpe.correction: 0.330438 hartree
zpe.thermalcorrener: 0.355376 hartree
zpe.thermalcorrenthalpy: 0.356320 hartree
zpe.thermalcorrgfe: 0.276469 hartree
zpe.sumelectzpe: -2003.098760 hartree
zpe.sumelectthermal: -2003.073822 hartree
zpe.sumelectthermalent: -2003.072878 hartree
zpe.sumelectthermalfe: -2003.152729 hartree
dipole: -1.3986 -1.2060 3.7686
dipole: 4.1967
quadrupole: -123.5372 -157.6346 -146.4128
quadrupole: -13.0268 -1.8194 0.0740
quadrupole: 18.9910 -15.1064 -3.8846 -13.0268 -1.8194 0.0740
hfenergy: -2003.4291981 hartree
pointgroup: C01 [X(C11H22F1N2O3P1S2)]
dipole: -0.3537058 0.3608538 -1.5719096 debye
polarizability: 211.6407589|-0.322604|238.1358335|2.8019163|-2.7698244|163.5661839 unknown
InChI: InChI=1S/C11H22FN2O3PS2/c1-10(2,3)14(20-13(6)9(12)15)18(19)16-7-11(4,5)8-17-18/h7-8H2,1-6H3
charge 0 multiplicity 1
42 atoms
S  -1.783497 0.443482 1.582004
S  2.046758 2.825841 0.988646
P  0.889086 1.227465 0.359031
F  -0.727709 -1.882342 2.912422
O  1.079076 -0.234827 1.288346
O  1.334531 0.605119 -1.226861
O  -0.946926 -3.432273 1.210586
N  -0.872079 1.286291 0.285823
N  -1.852286 -1.270588 0.979422
C  2.825321 -1.213467 -0.272604
C  2.463836 -0.795385 1.181465
C  2.715379 0.020462 -1.212832
C  -1.584296 2.423773 -0.45905
C  1.893331 -2.345849 -0.764566
C  4.302954 -1.68186 -0.26974
C  -2.915853 1.893669 -1.039834
C  -1.843837 3.593275 0.527213
C  -0.687615 2.900567 -1.630793
C  -2.446926 -1.539337 -0.345794
C  -1.150932 -2.278072 1.6108
H  2.437729 -1.665384 1.85694
H  3.177155 -0.040015 1.569717
H  3.433238 0.812966 -0.916826
H  2.88897 -0.263127 -2.263972
H  0.850094 -1.996621 -0.83583
H  2.20788 -2.697215 -1.765014
H  1.914481 -3.208254 -0.074345
H  4.986497 -0.887536 0.085647
H  4.430227 -2.561698 0.387313
H  4.621148 -1.977356 -1.286511
H  -3.580054 1.505119 -0.249663
H  -2.733101 1.098785 -1.782644
H  -3.437221 2.726788 -1.5444
H  -0.893507 3.950952 0.961129
H  -2.32805 4.435848 0.000697
H  -2.511934 3.27464 1.348683
H  -0.413168 2.065472 -2.295995
H  -1.255959 3.646667 -2.214544
H  0.236927 3.388677 -1.27642
H  -3.484732 -1.169213 -0.369267
H  -2.436464 -2.626724 -0.518235
H  -1.85817 -1.042117 -1.137044
