program: Orca
programVersion: 5.0.2
elementType: O O C C C C C C C C C C C C C C C C C C H H H H H H H H H H H H H H H H H H H H H H H H H H H H
charge: 0
multiplicity: 1
keywords: wb97x-d3
keywords: def2-TZVPP
keywords: def2/J RIJCOSX
keywords: DEFGRID2
keywords: scfconv7
keywords: smallprint printgap noloewdin
keywords: NOSOSCF
formula: C18H28O2
InChI: InChI=1/C18H28O2/c1-6-13-20-18(19)14-17(5)12-8-11-16(4)10-7-9-15(2)3/h1,8,12,14-16H,7,9-11,13H2,2-5H3
48 atoms
O  3.801812 -2.73404 0.133182
O  3.931349 -0.503879 0.168723
C  -3.751552 -0.767191 -0.010331
C  -3.642752 0.417573 -0.975039
C  -4.1080 1.76356 -0.428642
C  -3.856136 2.923312 -1.391515
C  -2.387392 3.301085 -1.611165
C  -2.890136 -0.605136 1.258256
C  -5.193033 -1.075017 0.37635
C  -2.267866 4.31842 -2.740464
C  -1.740543 3.845519 -0.341312
C  -1.491294 -0.181999 0.959231
C  -0.44907 -1.01737 0.899854
C  0.919951 -0.634049 0.566055
C  1.189194 0.806876 0.268084
C  1.836484 -1.626701 0.54532
C  3.265857 -1.508489 0.264384
C  5.199655 -2.815382 -0.11849
C  5.988286 -2.540286 1.075661
C  6.649863 -2.343509 2.058468
H  -3.356468 -1.638982 -0.544212
H  -2.605397 0.493428 -1.314313
H  -4.225219 0.182966 -1.872791
H  -5.180428 1.717002 -0.219304
H  -3.630868 1.973067 0.533714
H  -4.387874 3.811145 -1.030372
H  -4.309042 2.67812 -2.359155
H  -1.834691 2.404723 -1.915664
H  -2.888193 -1.555953 1.797551
H  -3.354351 0.131269 1.921619
H  -5.816332 -1.224166 -0.507871
H  -5.255961 -1.984698 0.977078
H  -5.63931 -0.269148 0.96259
H  -2.815754 5.2355 -2.506296
H  -2.669336 3.926294 -3.677582
H  -1.227247 4.596318 -2.920888
H  -1.765073 3.129793 0.482176
H  -0.692644 4.102369 -0.510212
H  -2.249902 4.751592 -0.00102
H  -1.343624 0.873519 0.752397
H  -0.61165 -2.070373 1.114459
H  2.188568 0.986649 -0.109987
H  1.056969 1.40957 1.169666
H  0.476547 1.184026 -0.467646
H  1.494583 -2.634119 0.753576
H  5.49853 -2.15104 -0.932402
H  5.375419 -3.839238 -0.449085
H  7.240758 -2.151581 2.926382
elementType: O C H
totalener: -853.24410861 hartree
nucrepener: 1482.77348116 hartree
electener: -2336.01758978 hartree
oneelecener: -4099.75599260 hartree
twoeener: 1763.73840282 hartree
cpcmener: -0.02247138 hartree
kineticenergy: 849.13880558 hartree
xcener: -85.608054842132 hartree
chargesum: -0.0000000
charge: -0.278747 -0.465742 0.086889 -0.160970 -0.162794 -0.184734 0.079369 -0.164810 -0.330042 -0.299190 -0.332144 -0.097831 -0.139175 0.019047 -0.257989 -0.182307 0.464189 0.027827 -0.416796 0.034394 0.053362 0.080563 0.085588 0.087545 0.074571 0.080808 0.072519 0.029235 0.088000 0.098146 0.093350 0.094924 0.084372 0.082479 0.088141 0.089501 0.096067 0.096512 0.095816 0.094593 0.110659 0.110737 0.113627 0.090948 0.116688 0.137060 0.134952 0.280790
qa: -0.2787 -0.4657 0.0869 -0.1610 -0.1628 -0.1847 0.0794 -0.1648 -0.3300 -0.2992 -0.3321 -0.0978 -0.1392 0.0190 -0.2580 -0.1823 0.4642 0.0278 -0.4168 0.0344 0.0534 0.0806 0.0856 0.0875 0.0746 0.0808 0.0725 0.0292 0.0880 0.0981 0.0934 0.0949 0.0844 0.0825 0.0881 0.0895 0.0961 0.0965 0.0958 0.0946 0.1107 0.1107 0.1136 0.0909 0.1167 0.1371 0.1350 0.2808
va: 2.1248 2.0389 3.8183 3.8580 3.8824 3.9196 3.7747 3.9073 3.9557 3.9327 3.9310 3.8675 3.9164 3.7136 3.9310 3.7913 4.1655 3.9141 3.7203 3.6439 1.0144 1.0088 1.0105 1.0083 1.0000 1.0105 1.0079 1.0226 1.0149 0.9996 1.0030 1.0038 0.9974 1.0036 1.0049 1.0042 0.9936 1.0023 1.0063 1.0007 1.0229 1.0316 0.9955 0.9958 1.0314 1.0000 0.9894 0.9490
dispcorr: -0.021223205 hartree
energy: -853.265331819548
dipole: -39.78808 38.42945 -1.35863 22.56867 -22.95124 -0.38257 -7.89729 7.76741 -0.12987
magnitude: 1.41743 au
magnitude: 3.60282 debye
