program: Orca
programVersion: 5.0.2
elementType: O O C C C C C C C C C C C C C C C C C C H H H H H H H H H H H H H H H H H H H H H H H H H H H H
charge: 0
multiplicity: 1
keywords: wb97x-d3
keywords: def2-TZVPP
keywords: def2/J RIJCOSX
keywords: DEFGRID2
keywords: scfconv7
keywords: smallprint printgap noloewdin
keywords: NOSOSCF
formula: C18H28O2
InChI: InChI=1/C18H28O2/c1-6-13-20-18(19)14-17(5)12-8-11-16(4)10-7-9-15(2)3/h1,8,12,14-16H,7,9-11,13H2,2-5H3
48 atoms
O  4.430364 -1.328693 -0.135036
O  3.595165 -2.535141 1.547706
C  -3.467967 -0.062928 -0.772315
C  -2.63885 1.219921 -0.71686
C  -3.452863 2.490687 -0.50416
C  -2.581015 3.741063 -0.557865
C  -3.308456 5.07202 -0.3411
C  -2.600424 -1.25998 -1.202815
C  -4.204862 -0.337209 0.534714
C  -4.33356 5.354876 -1.434839
C  -3.947364 5.166013 1.040868
C  -1.504273 -1.59355 -0.248035
C  -0.204413 -1.461694 -0.535299
C  0.902662 -1.794342 0.356249
C  0.566829 -2.312318 1.717744
C  2.148893 -1.588809 -0.123869
C  3.413465 -1.883244 0.546527
C  5.744617 -1.546849 0.365409
C  6.208679 -2.904414 0.108081
C  6.606863 -4.014145 -0.120033
H  -4.221143 0.058799 -1.559682
H  -1.889689 1.135713 0.078599
H  -2.074284 1.314678 -1.651649
H  -4.23577 2.545003 -1.267833
H  -3.966955 2.440962 0.45938
H  -2.071493 3.775929 -1.527383
H  -1.78776 3.649195 0.192566
H  -2.544145 5.855344 -0.400578
H  -2.178318 -1.057833 -2.190898
H  -3.250737 -2.13509 -1.309486
H  -3.528374 -0.335145 1.392442
H  -4.972372 0.413234 0.727389
H  -4.70645 -1.307016 0.510625
H  -4.747868 6.360185 -1.335266
H  -5.172381 4.656598 -1.398072
H  -3.888618 5.282328 -2.429808
H  -4.779771 4.468309 1.153891
H  -3.226308 4.949086 1.832077
H  -4.341764 6.167583 1.223989
H  -1.807825 -1.964646 0.726277
H  0.071758 -1.089901 -1.518336
H  -0.096067 -1.611353 2.228708
H  1.436208 -2.472073 2.343837
H  0.025936 -3.257914 1.642395
H  2.245568 -1.16218 -1.115682
H  5.807976 -1.318053 1.431654
H  6.378441 -0.833554 -0.162015
H  6.961015 -5.000659 -0.319567
elementType: O C H
totalener: -853.24555046 hartree
nucrepener: 1436.52439073 hartree
electener: -2289.76994119 hartree
oneelecener: -4007.52146665 hartree
twoeener: 1717.75152546 hartree
cpcmener: -0.02209256 hartree
kineticenergy: 849.15368493 hartree
xcener: -85.609711371346 hartree
chargesum: -0.0000000
charge: -0.279599 -0.464795 0.128029 -0.197847 -0.144542 -0.151507 0.072204 -0.137471 -0.339455 -0.314910 -0.317433 -0.132334 -0.149185 0.018712 -0.260532 -0.177182 0.462490 0.030489 -0.419685 0.034839 0.042534 0.069958 0.072410 0.069466 0.076374 0.073360 0.074653 0.037948 0.086721 0.099287 0.084631 0.096338 0.098174 0.093980 0.079571 0.091446 0.078427 0.092941 0.094629 0.128098 0.110340 0.102820 0.106371 0.108439 0.117534 0.136696 0.135471 0.281096
qa: -0.2796 -0.4648 0.1280 -0.1978 -0.1445 -0.1515 0.0722 -0.1375 -0.3395 -0.3149 -0.3174 -0.1323 -0.1492 0.0187 -0.2605 -0.1772 0.4625 0.0305 -0.4197 0.0348 0.0425 0.0700 0.0724 0.0695 0.0764 0.0734 0.0747 0.0379 0.0867 0.0993 0.0846 0.0963 0.0982 0.0940 0.0796 0.0914 0.0784 0.0929 0.0946 0.1281 0.1103 0.1028 0.1064 0.1084 0.1175 0.1367 0.1355 0.2811
va: 2.1247 2.0386 3.7327 3.9362 3.8849 3.8862 3.8244 3.9200 3.9614 3.9415 3.9428 3.8581 3.9074 3.7221 3.9288 3.7811 4.1657 3.9127 3.7172 3.6413 1.0188 1.0075 1.0128 1.0059 0.9972 1.0107 1.0096 1.0106 1.0134 1.0052 0.9961 1.0007 1.0034 1.0040 0.9983 1.0030 0.9983 1.0023 1.0047 0.9949 1.0238 0.9956 1.0309 0.9961 1.0309 1.0000 0.9889 0.9489
dispcorr: -0.019059015 hartree
energy: -853.264609478294
dipole: -43.71320 42.63632 -1.07688 28.08323 -27.37134 0.71189 -1.86112 1.24292 -0.61820
magnitude: 1.43131 au
magnitude: 3.63810 debye
