program: Orca
programVersion: 5.0.2
elementType: O O C C C C C C C C C C C C C C C C C C H H H H H H H H H H H H H H H H H H H H H H H H H H H H
charge: 0
multiplicity: 1
keywords: wb97x-d3
keywords: def2-TZVPP
keywords: def2/J RIJCOSX
keywords: DEFGRID2
keywords: scfconv7
keywords: smallprint printgap noloewdin
keywords: NOSOSCF
formula: C18H28O2
InChI: InChI=1/C18H28O2/c1-6-13-20-18(19)14-17(5)12-8-11-16(4)10-7-9-15(2)3/h1,8,12,14-16H,7,9-11,13H2,2-5H3
48 atoms
O  3.457858 -1.248026 1.152766
O  3.049038 -1.62641 -1.010591
C  -4.392658 -0.159595 -0.302692
C  -3.522668 1.026631 -0.730066
C  -3.000031 1.91621 0.396082
C  -1.94913 2.914361 -0.09353
C  -0.551586 2.32022 -0.303942
C  -3.623929 -1.191134 0.543273
C  -5.655356 0.278366 0.429455
C  0.298274 3.228205 -1.184914
C  0.153464 2.068451 1.024713
C  -2.340708 -1.60244 -0.092069
C  -1.142065 -1.448356 0.480577
C  0.143567 -1.716264 -0.155087
C  0.137491 -2.263788 -1.546119
C  1.245856 -1.413878 0.565486
C  2.633606 -1.460887 0.112972
C  4.851385 -1.179481 0.873788
C  5.210566 0.079846 0.233711
C  5.521122 1.125273 -0.269218
H  -4.700857 -0.66832 -1.223731
H  -2.679687 0.647822 -1.316906
H  -4.101499 1.647644 -1.422274
H  -3.835487 2.464574 0.839457
H  -2.583285 1.309168 1.205598
H  -1.867517 3.746604 0.614066
H  -2.301263 3.357152 -1.03227
H  -0.657042 1.359246 -0.821983
H  -4.265438 -2.070514 0.668926
H  -3.43486 -0.799057 1.54631
H  -6.225941 0.999555 -0.15925
H  -6.310465 -0.571816 0.630316
H  -5.426827 0.744793 1.389875
H  1.297282 2.814496 -1.338852
H  0.419336 4.216886 -0.734267
H  -0.153277 3.369176 -2.169126
H  -0.42637 1.425112 1.688938
H  1.124452 1.591622 0.876601
H  0.328601 3.009466 1.553614
H  -2.416109 -2.009924 -1.09666
H  -1.098587 -1.034347 1.484238
H  -0.531887 -3.12261 -1.610867
H  1.117379 -2.57503 -1.88762
H  -0.240316 -1.515172 -2.246131
H  1.10697 -1.060121 1.580588
H  5.180261 -2.024931 0.265491
H  5.347022 -1.258198 1.84144
H  5.797814 2.056419 -0.710981
elementType: O C H
totalener: -853.24425341 hartree
nucrepener: 1561.95985019 hartree
electener: -2415.20410360 hartree
oneelecener: -4258.56114256 hartree
twoeener: 1843.35703896 hartree
cpcmener: -0.02220152 hartree
kineticenergy: 849.15054470 hartree
xcener: -85.611236747622 hartree
chargesum: 0.0000000
charge: -0.280836 -0.466605 0.069896 -0.173941 -0.153230 -0.180154 0.087122 -0.140949 -0.328941 -0.294529 -0.325379 -0.091749 -0.190529 0.031010 -0.264151 -0.206455 0.480936 0.030061 -0.418707 0.033305 0.053763 0.085200 0.086800 0.087084 0.070558 0.080913 0.070620 0.013594 0.097813 0.079387 0.094112 0.095221 0.085357 0.089490 0.084641 0.086921 0.087137 0.091665 0.098535 0.128690 0.115987 0.104993 0.106283 0.112998 0.122309 0.136660 0.135786 0.281307
qa: -0.2808 -0.4666 0.0699 -0.1739 -0.1532 -0.1802 0.0871 -0.1409 -0.3289 -0.2945 -0.3254 -0.0917 -0.1905 0.0310 -0.2642 -0.2065 0.4809 0.0301 -0.4187 0.0333 0.0538 0.0852 0.0868 0.0871 0.0706 0.0809 0.0706 0.0136 0.0978 0.0794 0.0941 0.0952 0.0854 0.0895 0.0846 0.0869 0.0871 0.0917 0.0985 0.1287 0.1160 0.1050 0.1063 0.1130 0.1223 0.1367 0.1358 0.2813
va: 2.1175 2.0373 3.8065 3.8559 3.8751 3.9358 3.7585 3.9314 3.9531 3.9271 3.9366 3.8279 3.8952 3.6302 3.9313 3.7507 4.1548 3.9142 3.7179 3.6462 1.0137 1.0062 1.0095 1.0071 1.0047 1.0098 1.0061 1.0288 1.0076 1.0075 1.0028 1.0040 0.9961 1.0053 1.0028 1.0048 1.0015 0.9982 1.0103 1.0013 1.0194 0.9964 1.0272 0.9947 1.0275 1.0012 0.9888 0.9490
dispcorr: -0.023664743 hartree
energy: -853.267918156872
dipole: -29.53484 28.29426 -1.24057 14.96940 -15.02408 -0.05469 -1.52961 2.06883 0.53922
magnitude: 1.35380 au
magnitude: 3.44108 debye
