program: Orca
programVersion: 5.0.2
elementType: O O C C C C C C C C C C C C C C C C C C H H H H H H H H H H H H H H H H H H H H H H H H H H H H
charge: 0
multiplicity: 1
keywords: wb97x-d3
keywords: def2-TZVPP
keywords: def2/J RIJCOSX
keywords: DEFGRID2
keywords: scfconv7
keywords: smallprint printgap noloewdin
keywords: NOSOSCF
formula: C18H28O2
InChI: InChI=1/C18H28O2/c1-6-13-20-18(19)14-17(5)12-8-11-16(4)10-7-9-15(2)3/h1,8,12,14-16H,7,9-11,13H2,2-5H3
48 atoms
O  4.207476 -3.227931 1.491957
O  4.281131 -2.051455 -0.405226
C  -2.926587 0.571623 0.679767
C  -3.103567 1.204821 -0.702157
C  -3.855537 2.532033 -0.691048
C  -4.051753 3.090262 -2.096989
C  -4.852584 4.393342 -2.194805
C  -2.450422 -0.889493 0.583853
C  -2.005291 1.389138 1.57773
C  -6.29903 4.222003 -1.74225
C  -4.185461 5.545211 -1.450892
C  -1.102235 -1.050833 -0.032447
C  -0.040312 -1.547712 0.611542
C  1.29696 -1.7037 0.045218
C  1.504659 -1.283756 -1.374752
C  2.239983 -2.2322 0.855578
C  3.64761 -2.465472 0.537644
C  5.592832 -3.525962 1.360554
C  6.429737 -2.375744 1.677067
C  7.128911 -1.440868 1.956153
H  -3.914223 0.53385 1.154439
H  -2.123627 1.35185 -1.170434
H  -3.644514 0.502433 -1.346625
H  -4.825629 2.384062 -0.205219
H  -3.314577 3.259074 -0.079165
H  -4.545899 2.331322 -2.714142
H  -3.067758 3.250243 -2.551928
H  -4.874378 4.661003 -3.257484
H  -3.179025 -1.448458 -0.014129
H  -2.453938 -1.33517 1.582198
H  -1.842365 0.892563 2.536912
H  -1.025974 1.541214 1.117948
H  -2.420988 2.374126 1.793832
H  -6.881723 5.124034 -1.940415
H  -6.372154 4.02251 -0.671029
H  -6.787952 3.397053 -2.265541
H  -4.199701 5.395037 -0.369222
H  -3.142967 5.669707 -1.752508
H  -4.697503 6.488883 -1.650296
H  -1.004722 -0.736978 -1.067259
H  -0.159197 -1.859235 1.646012
H  0.7715 -1.769495 -2.020676
H  2.492986 -1.517422 -1.751786
H  1.349708 -0.207681 -1.477435
H  1.941241 -2.530662 1.854045
H  5.826394 -3.906053 0.363221
H  5.785221 -4.329982 2.071191
H  7.749778 -0.608646 2.202667
elementType: O C H
totalener: -853.24568124 hartree
nucrepener: 1421.22412092 hartree
electener: -2274.46980215 hartree
oneelecener: -3976.90270689 hartree
twoeener: 1702.43290473 hartree
cpcmener: -0.02216103 hartree
kineticenergy: 849.14663762 hartree
xcener: -85.608057249021 hartree
chargesum: -0.0000000
charge: -0.279521 -0.465427 0.136058 -0.202273 -0.144362 -0.153174 0.072157 -0.137576 -0.341594 -0.312546 -0.317058 -0.140591 -0.143007 0.021738 -0.262802 -0.178536 0.463313 0.029592 -0.420333 0.036918 0.042737 0.067889 0.076678 0.068177 0.076233 0.073285 0.075239 0.037264 0.095107 0.086665 0.096696 0.086381 0.098108 0.093088 0.079550 0.090881 0.078997 0.092491 0.094880 0.128243 0.110412 0.102967 0.107683 0.109146 0.117140 0.136938 0.135135 0.281014
qa: -0.2795 -0.4654 0.1361 -0.2023 -0.1444 -0.1532 0.0722 -0.1376 -0.3416 -0.3125 -0.3171 -0.1406 -0.1430 0.0217 -0.2628 -0.1785 0.4633 0.0296 -0.4203 0.0369 0.0427 0.0679 0.0767 0.0682 0.0762 0.0733 0.0752 0.0373 0.0951 0.0867 0.0967 0.0864 0.0981 0.0931 0.0796 0.0909 0.0790 0.0925 0.0949 0.1282 0.1104 0.1030 0.1077 0.1091 0.1171 0.1369 0.1351 0.2810
va: 2.1245 2.0376 3.7256 3.9456 3.8815 3.8852 3.8260 3.9332 3.9598 3.9411 3.9423 3.8663 3.8971 3.7223 3.9286 3.7834 4.1637 3.9134 3.7194 3.6413 1.0172 1.0067 1.0103 1.0067 0.9990 1.0105 1.0094 1.0107 1.0058 1.0128 1.0040 0.9975 1.0031 1.0042 0.9988 1.0031 0.9976 1.0024 1.0047 0.9985 1.0241 0.9957 1.0303 0.9964 1.0309 0.9999 0.9891 0.9490
dispcorr: -0.018931461 hartree
energy: -853.264612698607
dipole: -45.66216 44.28606 -1.37609 30.62799 -30.71359 -0.08560 -9.58902 9.86636 0.27734
magnitude: 1.40637 au
magnitude: 3.57471 debye
