program: Orca
programVersion: 5.0.2
elementType: O O C C C C C C C C C C C C C C C C C C H H H H H H H H H H H H H H H H H H H H H H H H H H H H
charge: 0
multiplicity: 1
keywords: wb97x-d3
keywords: def2-TZVPP
keywords: def2/J RIJCOSX
keywords: DEFGRID2
keywords: scfconv7
keywords: smallprint printgap noloewdin
keywords: NOSOSCF
formula: C18H28O2
InChI: InChI=1/C18H28O2/c1-6-13-20-18(19)14-17(5)12-8-11-16(4)10-7-9-15(2)3/h1,8,12,14-16H,7,9-11,13H2,2-5H3
48 atoms
O  3.30719 -2.697478 1.226294
O  3.708737 -1.084037 -0.26418
C  -3.509482 0.039064 1.318823
C  -2.950678 1.381009 0.843065
C  -3.189383 1.696493 -0.628185
C  -2.632318 3.059421 -1.022364
C  -2.84891 3.451019 -2.485238
C  -2.949318 -1.153141 0.519931
C  -3.281401 -0.133178 2.816875
C  -2.381574 4.883125 -2.722195
C  -2.146227 2.499083 -3.447775
C  -1.458738 -1.195921 0.479626
C  -0.739985 -1.168436 -0.646073
C  0.724987 -1.138019 -0.717184
C  1.247194 -0.337601 -1.867938
C  1.46012 -1.806682 0.193841
C  2.916586 -1.789952 0.315607
C  4.6994 -2.784793 1.506552
C  5.175272 -1.65643 2.296705
C  5.558214 -0.742363 2.974353
H  -4.592109 0.043465 1.147385
H  -3.392912 2.175623 1.453958
H  -1.87378 1.415374 1.04738
H  -2.733288 0.921471 -1.248636
H  -4.26414 1.663838 -0.841211
H  -1.556913 3.085551 -0.805695
H  -3.085327 3.824509 -0.381924
H  -3.925635 3.408798 -2.691129
H  -3.342644 -1.143699 -0.49901
H  -3.318862 -2.075754 0.982009
H  -3.755334 0.673642 3.379383
H  -3.699321 -1.074024 3.180323
H  -2.219926 -0.122475 3.074646
H  -1.31046 4.985054 -2.528564
H  -2.900796 5.588363 -2.069787
H  -2.559233 5.198744 -3.752412
H  -2.282908 2.814827 -4.484186
H  -1.070254 2.469635 -3.254052
H  -2.521614 1.477495 -3.373287
H  -0.942139 -1.217014 1.43582
H  -1.260096 -1.082347 -1.597125
H  0.772658 -0.684067 -2.789301
H  2.32207 -0.384312 -1.996028
H  0.957003 0.710057 -1.752176
H  0.944616 -2.424429 0.91933
H  5.286149 -2.882578 0.590309
H  4.823062 -3.70724 2.074212
H  5.899536 0.076595 3.566968
elementType: O C H
totalener: -853.24323364 hartree
nucrepener: 1490.94571973 hartree
electener: -2344.18895337 hartree
oneelecener: -4116.39403530 hartree
twoeener: 1772.20508192 hartree
cpcmener: -0.02222119 hartree
kineticenergy: 849.14430587 hartree
xcener: -85.605952538998 hartree
chargesum: 0.0000000
charge: -0.280862 -0.467849 0.071794 -0.172467 -0.121913 -0.161973 0.084846 -0.118924 -0.309800 -0.298052 -0.310499 -0.140557 -0.175226 0.074756 -0.248787 -0.242726 0.482344 0.032146 -0.418033 0.031591 0.043946 0.082466 0.069488 0.048858 0.071585 0.065572 0.071141 0.024407 0.088919 0.096764 0.091705 0.091171 0.081560 0.080442 0.087800 0.089534 0.094537 0.080385 0.090300 0.131247 0.120761 0.107049 0.103916 0.103378 0.120389 0.136236 0.135050 0.281584
qa: -0.2809 -0.4678 0.0718 -0.1725 -0.1219 -0.1620 0.0848 -0.1189 -0.3098 -0.2981 -0.3105 -0.1406 -0.1752 0.0748 -0.2488 -0.2427 0.4823 0.0321 -0.4180 0.0316 0.0439 0.0825 0.0695 0.0489 0.0716 0.0656 0.0711 0.0244 0.0889 0.0968 0.0917 0.0912 0.0816 0.0804 0.0878 0.0895 0.0945 0.0804 0.0903 0.1312 0.1208 0.1070 0.1039 0.1034 0.1204 0.1362 0.1351 0.2816
va: 2.1226 2.0361 3.8060 3.9015 3.8654 3.8860 3.8086 3.8793 3.9508 3.9324 3.9295 3.8800 3.9022 3.6834 3.9248 3.8200 4.1500 3.9116 3.7179 3.6464 1.0161 1.0099 1.0048 1.0128 1.0150 1.0118 1.0126 1.0180 1.0068 1.0061 1.0042 1.0053 1.0013 1.0030 1.0048 1.0052 1.0061 1.0037 1.0010 1.0002 1.0075 0.9992 1.0292 1.0007 1.0293 0.9994 0.9890 0.9487
dispcorr: -0.020410809 hartree
energy: -853.263644445619
dipole: -33.35638 31.93223 -1.42415 22.14604 -22.49468 -0.34863 -10.58418 10.78228 0.19811
magnitude: 1.47953 au
magnitude: 3.76066 debye
