program: Orca
programVersion: 5.0.2
elementType: O O C C C C C C C C C C C C C C C C C C H H H H H H H H H H H H H H H H H H H H H H H H H H H H
charge: 0
multiplicity: 1
keywords: wb97x-d3
keywords: def2-TZVPP
keywords: def2/J RIJCOSX
keywords: DEFGRID2
keywords: scfconv7
keywords: smallprint printgap noloewdin
keywords: NOSOSCF
formula: C18H28O2
InChI: InChI=1/C18H28O2/c1-6-13-20-18(19)14-17(5)12-8-11-16(4)10-7-9-15(2)3/h1,8,12,14-16H,7,9-11,13H2,2-5H3
48 atoms
O  3.996709 -3.330207 0.621465
O  4.38624 -1.201536 0.075071
C  -3.333591 -0.49028 0.070463
C  -3.299782 0.53131 -1.07088
C  -3.621907 1.971009 -0.684036
C  -3.607643 2.904114 -1.889354
C  -3.792715 4.386865 -1.561195
C  -2.346881 -0.172518 1.208964
C  -4.736512 -0.672208 0.63899
C  -3.627045 5.232925 -2.818608
C  -5.139522 4.670644 -0.904882
C  -0.936103 -0.019167 0.749095
C  0.00579 -0.952835 0.924674
C  1.396526 -0.852467 0.489522
C  1.820252 0.405268 -0.199236
C  2.187668 -1.91915 0.739821
C  3.61008 -2.057182 0.430777
C  5.368044 -3.633188 0.391932
C  6.226889 -3.12483 1.45381
C  6.936927 -2.735971 2.340675
H  -3.023521 -1.450711 -0.356895
H  -2.315952 0.503661 -1.551629
H  -4.008852 0.202741 -1.838547
H  -4.598699 2.012166 -0.194853
H  -2.897129 2.333015 0.053435
H  -4.386172 2.595674 -2.597875
H  -2.65551 2.779978 -2.417694
H  -3.004031 4.674933 -0.855123
H  -2.406019 -0.972918 1.951397
H  -2.663205 0.746037 1.713906
H  -5.095785 0.228316 1.141122
H  -5.453075 -0.92075 -0.146549
H  -4.761871 -1.481368 1.371559
H  -2.653304 5.072093 -3.286209
H  -3.712028 6.299003 -2.598079
H  -4.391773 4.990109 -3.561144
H  -5.964396 4.352661 -1.54854
H  -5.25278 4.158591 0.051643
H  -5.267408 5.738154 -0.713541
H  -0.692201 0.905142 0.233961
H  -0.264074 -1.868624 1.444213
H  1.755249 1.251121 0.488464
H  1.148871 0.624373 -1.030898
H  2.831796 0.36461 -0.58442
H  1.73784 -2.782251 1.217127
H  5.700953 -3.261922 -0.580039
H  5.423537 -4.721565 0.364329
H  7.56642 -2.387229 3.128717
elementType: O C H
totalener: -853.24628268 hartree
nucrepener: 1430.55323731 hartree
electener: -2283.79951999 hartree
oneelecener: -3995.39476833 hartree
twoeener: 1711.59524834 hartree
cpcmener: -0.02229632 hartree
kineticenergy: 849.14179229 hartree
xcener: -85.606354468873 hartree
chargesum: 0.0000000
charge: -0.279806 -0.465434 0.087599 -0.169905 -0.145154 -0.165435 0.078772 -0.165309 -0.327385 -0.296112 -0.304499 -0.116563 -0.143275 0.014398 -0.263105 -0.178342 0.464414 0.028905 -0.418455 0.034437 0.053941 0.079711 0.081794 0.083109 0.064024 0.066936 0.069294 0.025724 0.088372 0.100094 0.082248 0.093825 0.095090 0.087429 0.089364 0.079845 0.082942 0.088918 0.090878 0.125977 0.111208 0.111165 0.100577 0.107232 0.117203 0.136730 0.135224 0.281398
qa: -0.2798 -0.4654 0.0876 -0.1699 -0.1452 -0.1654 0.0788 -0.1653 -0.3274 -0.2961 -0.3045 -0.1166 -0.1433 0.0144 -0.2631 -0.1783 0.4644 0.0289 -0.4185 0.0344 0.0539 0.0797 0.0818 0.0831 0.0640 0.0669 0.0693 0.0257 0.0884 0.1001 0.0822 0.0938 0.0951 0.0874 0.0894 0.0798 0.0829 0.0889 0.0909 0.1260 0.1112 0.1112 0.1006 0.1072 0.1172 0.1367 0.1352 0.2814
va: 2.1247 2.0383 3.7996 3.8842 3.8601 3.8838 3.8107 3.9204 3.9516 3.9338 3.9296 3.8714 3.9237 3.7291 3.9312 3.7832 4.1633 3.9136 3.7169 3.6437 1.0165 1.0069 1.0096 1.0002 1.0066 1.0121 1.0126 1.0183 1.0139 0.9967 0.9986 1.0033 1.0042 1.0049 1.0050 1.0033 1.0025 1.0022 1.0051 0.9936 1.0241 0.9954 0.9967 1.0313 1.0309 0.9998 0.9893 0.9487
dispcorr: -0.018895148 hartree
energy: -853.265177827527
dipole: -46.29004 44.93129 -1.35875 28.11867 -28.30129 -0.18262 -10.41894 10.45228 0.03333
magnitude: 1.37138 au
magnitude: 3.48576 debye
