program: Orca
programVersion: 5.0.2
elementType: O O C C C C C C C C C C C C C C C C C C H H H H H H H H H H H H H H H H H H H H H H H H H H H H
charge: 0
multiplicity: 1
keywords: wb97x-d3
keywords: def2-TZVPP
keywords: def2/J RIJCOSX
keywords: DEFGRID2
keywords: scfconv7
keywords: smallprint printgap noloewdin
keywords: NOSOSCF
formula: C18H28O2
InChI: InChI=1/C18H28O2/c1-6-13-20-18(19)14-17(5)12-8-11-16(4)10-7-9-15(2)3/h1,8,12,14-16H,7,9-11,13H2,2-5H3
48 atoms
O  4.033053 -2.744898 1.528001
O  3.855441 -2.159443 -0.618742
C  -3.480622 0.215834 0.191327
C  -2.586652 1.400132 0.564852
C  -3.045538 2.767089 0.060369
C  -3.100207 2.861319 -1.461485
C  -3.354186 4.261309 -2.032435
C  -2.848041 -1.110074 0.643827
C  -4.87935 0.349409 0.780465
C  -4.694301 4.834747 -1.583185
C  -2.217649 5.231449 -1.726061
C  -1.541065 -1.38892 -0.015541
C  -0.398407 -1.630312 0.635914
C  0.896942 -1.875614 0.007996
C  0.958617 -1.869625 -1.486289
C  1.94055 -2.098472 0.836903
C  3.334964 -2.3243 0.459636
C  5.424654 -2.9794 1.344192
C  6.177401 -1.735717 1.253477
C  6.803258 -0.712842 1.200474
H  -3.573762 0.172974 -0.900193
H  -2.495431 1.432977 1.65703
H  -1.574329 1.220764 0.187397
H  -4.019347 3.019912 0.489278
H  -2.348771 3.514871 0.450139
H  -3.8782 2.191216 -1.841489
H  -2.156315 2.484105 -1.872575
H  -3.396409 4.146275 -3.121579
H  -3.540678 -1.922121 0.393261
H  -2.73536 -1.118468 1.732545
H  -5.396439 1.237484 0.414039
H  -5.500302 -0.511905 0.525932
H  -4.842653 0.417788 1.870931
H  -4.918588 5.767661 -2.104832
H  -4.704383 5.054967 -0.513395
H  -5.515972 4.143443 -1.784647
H  -1.250502 4.826246 -2.032356
H  -2.357063 6.177405 -2.253654
H  -2.153526 5.465694 -0.661253
H  -1.554785 -1.380086 -1.102274
H  -0.409546 -1.628029 1.722466
H  0.71499 -0.877463 -1.871491
H  0.216535 -2.556074 -1.896657
H  1.928573 -2.150696 -1.877485
H  1.745907 -2.115456 1.903414
H  5.612623 -3.604087 0.468947
H  5.743034 -3.541211 2.221754
H  7.371822 0.187476 1.140519
elementType: O C H
totalener: -853.24556913 hartree
nucrepener: 1443.24305356 hartree
electener: -2296.48862269 hartree
oneelecener: -4020.96667690 hartree
twoeener: 1724.47805421 hartree
cpcmener: -0.02213803 hartree
kineticenergy: 849.15020698 hartree
xcener: -85.609424215066 hartree
chargesum: -0.0000000
charge: -0.279862 -0.466018 0.076486 -0.193236 -0.161559 -0.153516 0.064193 -0.131584 -0.317453 -0.310972 -0.310378 -0.131869 -0.138427 0.018791 -0.261220 -0.181070 0.465693 0.031741 -0.418216 0.033497 0.047652 0.081083 0.080190 0.076718 0.087352 0.076813 0.077254 0.035943 0.095626 0.079855 0.091892 0.092306 0.086822 0.094247 0.080618 0.091284 0.091356 0.093036 0.078909 0.124146 0.112098 0.109864 0.103153 0.106208 0.117978 0.136366 0.135283 0.280926
qa: -0.2799 -0.4660 0.0765 -0.1932 -0.1616 -0.1535 0.0642 -0.1316 -0.3175 -0.3110 -0.3104 -0.1319 -0.1384 0.0188 -0.2612 -0.1811 0.4657 0.0317 -0.4182 0.0335 0.0477 0.0811 0.0802 0.0767 0.0874 0.0768 0.0773 0.0359 0.0956 0.0799 0.0919 0.0923 0.0868 0.0942 0.0806 0.0913 0.0914 0.0930 0.0789 0.1241 0.1121 0.1099 0.1032 0.1062 0.1180 0.1364 0.1353 0.2809
va: 2.1247 2.0370 3.7514 3.9162 3.8808 3.8716 3.8349 3.9182 3.9540 3.9389 3.9403 3.8778 3.8993 3.7256 3.9280 3.7833 4.1630 3.9125 3.7194 3.6442 1.0213 1.0116 1.0097 0.9980 1.0076 1.0098 1.0096 1.0099 1.0054 1.0156 1.0007 1.0051 1.0016 1.0048 0.9982 1.0034 1.0029 1.0042 1.0001 1.0051 1.0231 0.9961 0.9959 1.0308 1.0305 1.0006 0.9891 0.9492
dispcorr: -0.019340505 hartree
energy: -853.264909635066
dipole: -42.23078 40.93380 -1.29698 27.91284 -27.98260 -0.06976 -8.28947 8.66251 0.37304
magnitude: 1.35136 au
magnitude: 3.43489 debye
