program: Orca
programVersion: 5.0.2
elementType: O O C C C C C C C C C C C C C C C C C C H H H H H H H H H H H H H H H H H H H H H H H H H H H H
charge: 0
multiplicity: 1
keywords: wb97x-d3
keywords: def2-TZVPP
keywords: def2/J RIJCOSX
keywords: DEFGRID2
keywords: scfconv7
keywords: smallprint printgap noloewdin
keywords: NOSOSCF
formula: C18H28O2
InChI: InChI=1/C18H28O2/c1-6-13-20-18(19)14-17(5)12-8-11-16(4)10-7-9-15(2)3/h1,8,12,14-16H,7,9-11,13H2,2-5H3
48 atoms
O  3.256681 -1.825472 -1.036174
O  3.373868 -2.799622 0.970407
C  -3.321506 -0.040263 -0.905421
C  -2.646266 1.003695 -0.015496
C  -2.670691 2.427082 -0.560578
C  -1.869176 3.384854 0.314211
C  -1.726805 4.804797 -0.235455
C  -3.126022 -1.45639 -0.335526
C  -4.808324 0.235438 -1.094105
C  -3.074498 5.493186 -0.421203
C  -0.828662 5.634149 0.675541
C  -1.690979 -1.851284 -0.260878
C  -1.044086 -2.15745 0.866235
C  0.374445 -2.515044 0.981853
C  0.680698 -3.400261 2.149503
C  1.271423 -2.024564 0.102715
C  2.709387 -2.280627 0.103807
C  4.662196 -1.978971 -1.192072
C  5.419185 -1.079787 -0.330485
C  6.052571 -0.322586 0.352867
H  -2.840472 -0.009783 -1.891357
H  -3.114792 0.983006 0.976366
H  -1.601957 0.715948 0.142522
H  -2.259854 2.432416 -1.577088
H  -3.702092 2.777993 -0.64638
H  -0.866933 2.967755 0.463564
H  -2.324927 3.432956 1.310956
H  -1.242122 4.737638 -1.217362
H  -3.654797 -2.163807 -0.983816
H  -3.590811 -1.52317 0.653109
H  -5.328494 0.261846 -0.133039
H  -4.988415 1.188568 -1.59246
H  -5.279924 -0.538929 -1.702559
H  -3.631361 5.528564 0.519261
H  -3.701314 4.986248 -1.156292
H  -2.94731 6.522146 -0.764221
H  -1.273297 5.750595 1.667494
H  0.149968 5.167818 0.808511
H  -0.662306 6.635185 0.272379
H  -1.158663 -1.879811 -1.208968
H  -1.60506 -2.181811 1.79745
H  1.635496 -3.908704 2.079908
H  -0.104117 -4.148687 2.266904
H  0.684231 -2.806149 3.067552
H  0.922437 -1.364795 -0.682613
H  4.864201 -1.744114 -2.237296
H  4.969789 -3.01359 -1.022608
H  6.620331 0.336688 0.970679
elementType: O C H
totalener: -853.24441502 hartree
nucrepener: 1455.66178147 hartree
electener: -2308.90619649 hartree
oneelecener: -4045.90424584 hartree
twoeener: 1736.99804935 hartree
cpcmener: -0.02226499 hartree
kineticenergy: 849.14925884 hartree
xcener: -85.605353509057 hartree
chargesum: -0.0000000
charge: -0.282742 -0.467579 0.094183 -0.171957 -0.125895 -0.157416 0.074501 -0.115900 -0.323379 -0.306643 -0.297977 -0.140425 -0.150504 0.053589 -0.250193 -0.224693 0.476008 0.028444 -0.417369 0.033097 0.040750 0.068099 0.073848 0.062164 0.072142 0.068899 0.065332 0.026680 0.094902 0.079792 0.086168 0.092149 0.091877 0.083169 0.089304 0.090847 0.080285 0.087880 0.089772 0.120002 0.119564 0.101756 0.104332 0.112974 0.117149 0.134719 0.137635 0.280662
qa: -0.2827 -0.4676 0.0942 -0.1720 -0.1259 -0.1574 0.0745 -0.1159 -0.3234 -0.3066 -0.2980 -0.1404 -0.1505 0.0536 -0.2502 -0.2247 0.4760 0.0284 -0.4174 0.0331 0.0407 0.0681 0.0738 0.0622 0.0721 0.0689 0.0653 0.0267 0.0949 0.0798 0.0862 0.0921 0.0919 0.0832 0.0893 0.0908 0.0803 0.0879 0.0898 0.1200 0.1196 0.1018 0.1043 0.1130 0.1171 0.1347 0.1376 0.2807
va: 2.1223 2.0351 3.7704 3.9017 3.8864 3.8846 3.8141 3.9111 3.9522 3.9307 3.9348 3.9023 3.8614 3.7406 3.9369 3.8292 4.1531 3.9163 3.7118 3.6493 1.0218 1.0121 1.0089 1.0095 1.0045 1.0132 1.0106 1.0178 1.0071 1.0152 1.0003 1.0016 1.0051 1.0021 1.0018 1.0050 1.0032 1.0047 1.0051 1.0116 1.0135 1.0225 0.9993 0.9947 1.0299 0.9892 0.9981 0.9493
dispcorr: -0.018674758 hartree
energy: -853.263089778222
dipole: -33.90226 32.65524 -1.24702 27.08809 -26.84552 0.24257 0.02783 -0.74185 -0.71402
magnitude: 1.45730 au
magnitude: 3.70417 debye
