program: Orca
programVersion: 5.0.2
elementType: O O C C C C C C C C C C C C C C C C C C H H H H H H H H H H H H H H H H H H H H H H H H H H H H
charge: 0
multiplicity: 1
keywords: wb97x-d3
keywords: def2-TZVPP
keywords: def2/J RIJCOSX
keywords: DEFGRID2
keywords: scfconv7
keywords: smallprint printgap noloewdin
keywords: NOSOSCF
formula: C18H28O2
InChI: InChI=1/C18H28O2/c1-6-13-20-18(19)14-17(5)12-8-11-16(4)10-7-9-15(2)3/h1,8,12,14-16H,7,9-11,13H2,2-5H3
48 atoms
O  3.331679 -0.193778 1.083224
O  3.144028 -1.437018 -0.761343
C  -4.421062 -0.319727 0.290967
C  -3.646096 0.978778 0.557795
C  -2.792075 1.464184 -0.61254
C  -1.74579 2.483832 -0.182494
C  -0.916464 3.086351 -1.317528
C  -3.607398 -1.561251 0.709913
C  -5.757169 -0.327736 1.024204
C  0.013818 4.166506 -0.776626
C  -0.116482 2.028886 -2.071187
C  -2.293355 -1.675477 0.01841
C  -1.113234 -1.459501 0.609691
C  0.182862 -1.469163 -0.0623
C  0.219688 -1.887075 -1.496992
C  1.243644 -1.050411 0.662788
C  2.631221 -0.943279 0.215523
C  4.707466 0.022646 0.794003
C  5.519444 -1.166689 1.019367
C  6.221391 -2.117882 1.229826
H  -4.625589 -0.392163 -0.784085
H  -4.346652 1.775191 0.827861
H  -3.012857 0.837704 1.441847
H  -2.300739 0.614259 -1.090064
H  -3.444906 1.900023 -1.376947
H  -1.06712 2.011298 0.539226
H  -2.242324 3.296175 0.360665
H  -1.6068 3.558975 -2.027173
H  -4.2028 -2.454493 0.493858
H  -3.45789 -1.530557 1.793607
H  -5.615918 -0.225301 2.103159
H  -6.391414 0.497886 0.696668
H  -6.307877 -1.254666 0.850994
H  0.732023 3.747341 -0.066879
H  -0.540423 4.95131 -0.257307
H  0.584954 4.642674 -1.576225
H  -0.756987 1.281638 -2.541887
H  0.484112 2.480326 -2.863834
H  0.569986 1.503454 -1.40059
H  -2.334224 -1.910824 -1.041187
H  -1.099366 -1.213856 1.668013
H  -0.100895 -2.926265 -1.595928
H  1.200061 -1.794192 -1.948401
H  -0.479134 -1.287008 -2.082335
H  1.064622 -0.726969 1.68201
H  5.023714 0.815666 1.471861
H  4.844843 0.387784 -0.226511
H  6.832298 -2.976086 1.400011
elementType: O C H
totalener: -853.24393818 hartree
nucrepener: 1538.82654954 hartree
electener: -2392.07048771 hartree
oneelecener: -4212.13740894 hartree
twoeener: 1820.06692122 hartree
cpcmener: -0.02240198 hartree
kineticenergy: 849.14859000 hartree
xcener: -85.607592751960 hartree
chargesum: -0.0000000
charge: -0.281263 -0.464904 0.077706 -0.190110 -0.120856 -0.181588 0.098909 -0.133729 -0.309393 -0.297766 -0.314813 -0.077311 -0.188349 0.006950 -0.265419 -0.181628 0.475678 0.026161 -0.419798 0.037164 0.047940 0.083582 0.068917 0.061751 0.080285 0.060305 0.077983 0.026554 0.089930 0.080876 0.087783 0.089285 0.088285 0.080794 0.087532 0.089773 0.092097 0.099131 0.070486 0.130389 0.113889 0.121429 0.110903 0.093231 0.117150 0.135253 0.138036 0.280789
qa: -0.2813 -0.4649 0.0777 -0.1901 -0.1209 -0.1816 0.0989 -0.1337 -0.3094 -0.2978 -0.3148 -0.0773 -0.1883 0.0070 -0.2654 -0.1816 0.4757 0.0262 -0.4198 0.0372 0.0479 0.0836 0.0689 0.0618 0.0803 0.0603 0.0780 0.0266 0.0899 0.0809 0.0878 0.0893 0.0883 0.0808 0.0875 0.0898 0.0921 0.0991 0.0705 0.1304 0.1139 0.1214 0.1109 0.0932 0.1171 0.1353 0.1380 0.2808
va: 2.1192 2.0367 3.7458 3.8910 3.8400 3.8899 3.7949 3.9399 3.9479 3.9345 3.9418 3.8283 3.8916 3.6893 3.9187 3.7788 4.1380 3.9155 3.7179 3.6429 1.0207 1.0068 1.0100 1.0091 1.0134 1.0114 1.0119 1.0185 1.0084 1.0118 0.9997 1.0037 1.0048 1.0023 1.0051 1.0053 0.9976 1.0082 1.0040 0.9976 1.0220 0.9980 1.0297 0.9964 1.0318 0.9894 0.9987 0.9491
dispcorr: -0.022417212 hartree
energy: -853.266355386712
dipole: -30.73830 29.34639 -1.39191 15.31643 -14.80801 0.50842 -5.85974 6.14357 0.28383
magnitude: 1.50879 au
magnitude: 3.83505 debye
