program: Orca
programVersion: 5.0.2
elementType: O O C C C C C C C C C C C C C C C C C C H H H H H H H H H H H H H H H H H H H H H H H H H H H H
charge: 0
multiplicity: 1
keywords: wb97x-d3
keywords: def2-TZVPP
keywords: def2/J RIJCOSX
keywords: DEFGRID2
keywords: scfconv7
keywords: smallprint printgap noloewdin
keywords: NOSOSCF
formula: C18H28O2
InChI: InChI=1/C18H28O2/c1-6-13-20-18(19)14-17(5)12-8-11-16(4)10-7-9-15(2)3/h1,8,12,14-16H,7,9-11,13H2,2-5H3
48 atoms
O  3.963491 -3.176196 -0.385043
O  3.748009 -1.874724 1.414848
C  -3.127923 -0.100601 -0.935621
C  -3.088403 1.104456 0.005223
C  -3.150694 2.458643 -0.694202
C  -2.927824 3.616773 0.27228
C  -2.838337 4.997966 -0.379054
C  -2.930795 -1.424948 -0.172903
C  -4.41808 -0.16242 -1.74494
C  -4.131885 5.391238 -1.084336
C  -2.457648 6.048142 0.658674
C  -1.646188 -1.467722 0.588242
C  -0.511889 -1.97233 0.09077
C  0.787626 -1.937687 0.755092
C  0.845162 -1.365318 2.135432
C  1.838285 -2.426684 0.060296
C  3.239745 -2.439333 0.474262
C  5.363766 -3.25973 -0.146569
C  6.050194 -2.009966 -0.44941
C  6.627494 -0.991501 -0.715327
H  -2.288678 -0.008162 -1.636227
H  -3.909682 1.025622 0.728132
H  -2.164924 1.069035 0.592612
H  -2.386056 2.492614 -1.47921
H  -4.112823 2.575172 -1.19902
H  -2.000767 3.434016 0.82722
H  -3.729225 3.626547 1.021332
H  -2.039667 4.9631 -1.130308
H  -2.96023 -2.24746 -0.892524
H  -3.772038 -1.569264 0.512499
H  -5.293184 -0.210038 -1.0918
H  -4.536289 0.707567 -2.391748
H  -4.438605 -1.044663 -2.388075
H  -4.38478 4.71101 -1.898833
H  -4.057368 6.3923 -1.514309
H  -4.973226 5.396475 -0.38581
H  -1.510958 5.80602 1.14636
H  -2.349705 7.037088 0.208443
H  -3.218633 6.125123 1.439936
H  -1.648358 -1.020611 1.576972
H  -0.529428 -2.416452 -0.901368
H  0.116909 -1.864727 2.777425
H  0.576117 -0.306464 2.119831
H  1.82051 -1.455558 2.598175
H  1.646265 -2.849571 -0.919473
H  5.723557 -4.048707 -0.80741
H  5.574246 -3.569524 0.879936
H  7.141238 -0.084304 -0.947195
elementType: O C H
totalener: -853.24634946 hartree
nucrepener: 1430.33124930 hartree
electener: -2283.57759875 hartree
oneelecener: -3995.12531021 hartree
twoeener: 1711.54771145 hartree
cpcmener: -0.02212555 hartree
kineticenergy: 849.14425551 hartree
xcener: -85.605384657409 hartree
chargesum: 0.0000000
charge: -0.279912 -0.465368 0.092985 -0.172865 -0.124325 -0.158460 0.074658 -0.141490 -0.323586 -0.303708 -0.297428 -0.126418 -0.143362 0.012665 -0.260247 -0.180979 0.467036 0.029254 -0.417741 0.033508 0.043244 0.070511 0.073871 0.062541 0.071990 0.068290 0.066226 0.026488 0.087361 0.093692 0.086640 0.092423 0.092210 0.088582 0.090578 0.082230 0.087898 0.089508 0.079944 0.129506 0.112772 0.103878 0.107464 0.106964 0.117840 0.134938 0.137105 0.281090
qa: -0.2799 -0.4654 0.0930 -0.1729 -0.1243 -0.1585 0.0747 -0.1415 -0.3236 -0.3037 -0.2974 -0.1264 -0.1434 0.0127 -0.2602 -0.1810 0.4670 0.0293 -0.4177 0.0335 0.0432 0.0705 0.0739 0.0625 0.0720 0.0683 0.0662 0.0265 0.0874 0.0937 0.0866 0.0924 0.0922 0.0886 0.0906 0.0822 0.0879 0.0895 0.0799 0.1295 0.1128 0.1039 0.1075 0.1070 0.1178 0.1349 0.1371 0.2811
va: 2.1246 2.0377 3.7923 3.9047 3.8817 3.8881 3.8165 3.9219 3.9526 3.9311 3.9336 3.8706 3.8904 3.7210 3.9295 3.7828 4.1621 3.9136 3.7127 3.6473 1.0220 1.0097 1.0106 1.0094 1.0043 1.0124 1.0108 1.0180 1.0133 1.0081 1.0007 1.0013 1.0049 1.0024 1.0049 1.0024 1.0049 1.0049 1.0032 0.9928 1.0228 0.9961 0.9966 1.0305 1.0308 0.9895 0.9990 0.9490
dispcorr: -0.018428880 hartree
energy: -853.264778335768
dipole: -41.03438 39.84787 -1.18651 30.48915 -30.70314 -0.21399 -2.74411 2.23277 -0.51134
magnitude: 1.30961 au
magnitude: 3.32876 debye
