program: Orca
programVersion: 5.0.2
elementType: O O C C C C C C C C C C C C C C C C C C H H H H H H H H H H H H H H H H H H H H H H H H H H H H
charge: 0
multiplicity: 1
keywords: wb97x-d3
keywords: def2-TZVPP
keywords: def2/J RIJCOSX
keywords: DEFGRID2
keywords: scfconv7
keywords: smallprint printgap noloewdin
keywords: NOSOSCF
formula: C18H28O2
InChI: InChI=1/C18H28O2/c1-6-13-20-18(19)14-17(5)12-8-11-16(4)10-7-9-15(2)3/h1,8,12,14-16H,7,9-11,13H2,2-5H3
48 atoms
O  3.944984 -3.026764 1.311083
O  3.972302 -1.629212 -0.430243
C  -3.391358 0.179023 0.793584
C  -3.490496 1.142923 -0.390585
C  -4.27612 2.416146 -0.096686
C  -4.50253 3.291212 -1.32751
C  -3.239302 3.797628 -2.028302
C  -2.866231 -1.202261 0.356752
C  -2.552269 0.749293 1.931318
C  -3.614768 4.633185 -3.247475
C  -2.34387 4.594842 -1.087604
C  -1.486841 -1.163325 -0.207677
C  -0.417271 -1.692748 0.395558
C  0.952838 -1.627596 -0.104518
C  1.18272 -0.948603 -1.41658
C  1.906347 -2.194108 0.667089
C  3.345573 -2.223746 0.415427
C  5.36234 -3.132404 1.243323
C  6.020023 -1.937983 1.757775
C  6.572849 -0.969231 2.202549
H  -4.40581 0.009408 1.17325
H  -2.481862 1.402087 -0.728912
H  -3.967908 0.62579 -1.231305
H  -5.253177 2.142842 0.315585
H  -3.778072 2.997765 0.683873
H  -5.109006 4.157165 -1.037527
H  -5.105048 2.731122 -2.051462
H  -2.668464 2.932826 -2.385075
H  -3.548343 -1.605206 -0.399581
H  -2.899255 -1.884786 1.210201
H  -1.546619 1.012691 1.59583
H  -3.001788 1.648771 2.353958
H  -2.447801 0.030199 2.746763
H  -4.182719 5.521699 -2.959292
H  -4.228477 4.064848 -3.949685
H  -2.728513 4.972072 -3.787983
H  -1.470347 4.986692 -1.612602
H  -2.880327 5.447001 -0.661209
H  -1.973675 3.991201 -0.257031
H  -1.370377 -0.654216 -1.159332
H  -0.55456 -2.199783 1.346936
H  2.210631 -1.00222 -1.753151
H  0.902852 0.104877 -1.351567
H  0.549085 -1.394415 -2.18523
H  1.592771 -2.682385 1.58275
H  5.699065 -3.346396 0.226483
H  5.619967 -3.991826 1.862482
H  7.056271 -0.096313 2.580983
elementType: O C H
totalener: -853.24582913 hartree
nucrepener: 1451.60786320 hartree
electener: -2304.85369233 hartree
oneelecener: -4037.61008442 hartree
twoeener: 1732.75639210 hartree
cpcmener: -0.02204147 hartree
kineticenergy: 849.15456371 hartree
xcener: -85.610013042664 hartree
chargesum: 0.0000000
charge: -0.279449 -0.465865 0.145174 -0.209855 -0.133270 -0.186942 0.066352 -0.139309 -0.344769 -0.298183 -0.301875 -0.138450 -0.145706 0.023013 -0.261785 -0.180762 0.466393 0.029733 -0.419327 0.034722 0.042755 0.069847 0.080779 0.078227 0.072456 0.077551 0.073049 0.034363 0.094464 0.087810 0.084824 0.099275 0.097048 0.081485 0.087958 0.089274 0.091671 0.085042 0.085459 0.126429 0.110849 0.108122 0.107267 0.103754 0.117072 0.137029 0.135224 0.281076
qa: -0.2794 -0.4659 0.1452 -0.2099 -0.1333 -0.1869 0.0664 -0.1393 -0.3448 -0.2982 -0.3019 -0.1384 -0.1457 0.0230 -0.2618 -0.1808 0.4664 0.0297 -0.4193 0.0347 0.0428 0.0698 0.0808 0.0782 0.0725 0.0776 0.0730 0.0344 0.0945 0.0878 0.0848 0.0993 0.0970 0.0815 0.0880 0.0893 0.0917 0.0850 0.0855 0.1264 0.1108 0.1081 0.1073 0.1038 0.1171 0.1370 0.1352 0.2811
va: 2.1250 2.0383 3.7223 3.9317 3.8756 3.9065 3.7870 3.9397 3.9638 3.9302 3.9335 3.8613 3.8851 3.7122 3.9264 3.7757 4.1673 3.9124 3.7212 3.6435 1.0177 0.9989 1.0089 1.0126 1.0026 1.0111 1.0094 1.0153 1.0072 1.0130 0.9980 1.0034 1.0042 1.0039 1.0045 1.0047 1.0057 1.0028 1.0012 0.9980 1.0240 1.0320 0.9966 0.9958 1.0313 1.0004 0.9891 0.9489
dispcorr: -0.019603085 hartree
energy: -853.265432211314
dipole: -39.47135 38.11775 -1.35359 27.97828 -28.23540 -0.25712 -9.44481 9.70136 0.25655
magnitude: 1.40148 au
magnitude: 3.56228 debye
