program: Orca
programVersion: 5.0.2
elementType: O O C C C C C C C C C C C C C C C C C C H H H H H H H H H H H H H H H H H H H H H H H H H H H H
charge: 0
multiplicity: 1
keywords: wb97x-d3
keywords: def2-TZVPP
keywords: def2/J RIJCOSX
keywords: DEFGRID2
keywords: scfconv7
keywords: smallprint printgap noloewdin
keywords: NOSOSCF
formula: C18H28O2
InChI: InChI=1/C18H28O2/c1-6-13-20-18(19)14-17(5)12-8-11-16(4)10-7-9-15(2)3/h1,8,12,14-16H,7,9-11,13H2,2-5H3
48 atoms
O  4.01613 -0.817696 -0.027794
O  3.3116 -2.409927 1.370116
C  -3.935376 -0.158064 -0.5325
C  -3.230428 1.118783 -0.06909
C  -2.554827 1.918143 -1.177346
C  -1.790695 3.143316 -0.679336
C  -2.607094 4.190477 0.08144
C  -2.979617 -1.166853 -1.199072
C  -4.702093 -0.791822 0.624098
C  -1.701389 5.331448 0.532433
C  -3.770209 4.725465 -0.746122
C  -1.859204 -1.604876 -0.317465
C  -0.57289 -1.328715 -0.55989
C  0.55825 -1.736339 0.268949
C  0.271494 -2.552659 1.48832
C  1.779565 -1.320149 -0.131932
C  3.064537 -1.601951 0.505735
C  5.342369 -0.973335 0.463438
C  5.975057 -2.183154 -0.045744
C  6.514566 -3.159819 -0.488855
H  -4.665474 0.121233 -1.301188
H  -3.974544 1.748555 0.428631
H  -2.491852 0.866561 0.700985
H  -1.844284 1.282497 -1.712874
H  -3.3033 2.213489 -1.919799
H  -1.313323 3.631349 -1.537197
H  -0.971307 2.80319 -0.03598
H  -3.020173 3.722686 0.982218
H  -2.578095 -0.747287 -2.123919
H  -3.566607 -2.045165 -1.489198
H  -5.468157 -0.112316 1.002511
H  -5.20414 -1.712048 0.318173
H  -4.047346 -1.036288 1.463531
H  -1.270775 5.856927 -0.324107
H  -0.873065 4.967515 1.144161
H  -2.248014 6.066654 1.126599
H  -3.418119 5.171104 -1.680526
H  -4.488617 3.945847 -1.005297
H  -4.318447 5.497755 -0.202437
H  -2.132079 -2.175258 0.565296
H  -0.32569 -0.757383 -1.45074
H  -0.155197 -3.51733 1.206014
H  -0.471783 -2.050883 2.110118
H  1.148656 -2.739139 2.095727
H  1.836623 -0.697399 -1.017484
H  5.368289 -0.958673 1.555246
H  5.886781 -0.097167 0.110541
H  6.988576 -4.033779 -0.87646
elementType: O C H
totalener: -853.24569723 hartree
nucrepener: 1472.91055869 hartree
electener: -2326.15625592 hartree
oneelecener: -4080.20630223 hartree
twoeener: 1754.05004631 hartree
cpcmener: -0.02223139 hartree
kineticenergy: 849.14547058 hartree
xcener: -85.608899138743 hartree
chargesum: 0.0000000
charge: -0.279284 -0.465433 0.094640 -0.198766 -0.137112 -0.191471 0.071476 -0.141456 -0.313715 -0.297419 -0.304150 -0.128153 -0.153926 0.016176 -0.263024 -0.176573 0.463476 0.028236 -0.419270 0.036424 0.044318 0.083451 0.077288 0.078361 0.077385 0.076858 0.073878 0.032962 0.092434 0.101111 0.092160 0.095408 0.080687 0.080633 0.088237 0.089423 0.085055 0.086359 0.091107 0.129079 0.112940 0.110939 0.102438 0.106267 0.117412 0.136996 0.135354 0.280781
qa: -0.2793 -0.4654 0.0946 -0.1988 -0.1371 -0.1915 0.0715 -0.1415 -0.3137 -0.2974 -0.3042 -0.1282 -0.1539 0.0162 -0.2630 -0.1766 0.4635 0.0282 -0.4193 0.0364 0.0443 0.0835 0.0773 0.0784 0.0774 0.0769 0.0739 0.0330 0.0924 0.1011 0.0922 0.0954 0.0807 0.0806 0.0882 0.0894 0.0851 0.0864 0.0911 0.1291 0.1129 0.1109 0.1024 0.1063 0.1174 0.1370 0.1354 0.2808
va: 2.1246 2.0384 3.7766 3.8948 3.8640 3.9098 3.7925 3.9091 3.9495 3.9314 3.9338 3.8377 3.9080 3.7281 3.9283 3.7834 4.1646 3.9132 3.7193 3.6408 1.0170 1.0076 1.0058 1.0152 1.0066 1.0101 1.0097 1.0148 1.0056 1.0055 1.0056 1.0041 0.9992 1.0041 1.0045 1.0047 1.0028 1.0017 1.0056 0.9934 1.0227 0.9957 0.9957 1.0311 1.0313 1.0002 0.9892 0.9491
dispcorr: -0.019967766 hartree
energy: -853.265664997758
dipole: -38.43003 37.25587 -1.17417 23.98943 -23.33851 0.65092 -1.33031 0.85412 -0.47619
magnitude: 1.42447 au
magnitude: 3.62072 debye
