program: Orca
programVersion: 5.0.2
elementType: O O C C C C C C C C C C C C C C C C C C H H H H H H H H H H H H H H H H H H H H H H H H H H H H
charge: 0
multiplicity: 1
keywords: wb97x-d3
keywords: def2-TZVPP
keywords: def2/J RIJCOSX
keywords: DEFGRID2
keywords: scfconv7
keywords: smallprint printgap noloewdin
keywords: NOSOSCF
formula: C18H28O2
InChI: InChI=1/C18H28O2/c1-6-13-20-18(19)14-17(5)12-8-11-16(4)10-7-9-15(2)3/h1,8,12,14-16H,7,9-11,13H2,2-5H3
48 atoms
O  4.926615 -1.78393 0.246443
O  3.836079 -3.727651 0.099768
C  -2.529033 0.668375 -0.211197
C  -3.418955 1.820609 0.26061
C  -3.856785 2.782297 -0.838344
C  -4.637868 3.970366 -0.286933
C  -5.160571 4.947723 -1.341659
C  -1.928831 -0.047436 1.012314
C  -3.279184 -0.299616 -1.118546
C  -6.03411 6.013594 -0.689052
C  -4.029749 5.59837 -2.130954
C  -0.965715 -1.131221 0.660151
C  0.362576 -0.990208 0.730443
C  1.342816 -2.01783 0.390263
C  0.826249 -3.347065 -0.059485
C  2.645422 -1.675714 0.501256
C  3.807517 -2.529146 0.256725
C  6.158959 -2.467607 0.046319
C  6.580295 -3.190146 1.240509
C  6.940673 -3.770078 2.228651
H  -1.693658 1.0950 -0.779904
H  -4.300898 1.410612 0.767177
H  -2.875616 2.393066 1.020665
H  -2.968121 3.132153 -1.372864
H  -4.473972 2.262848 -1.577984
H  -4.008034 4.51982 0.423499
H  -5.486799 3.59316 0.294254
H  -5.785805 4.383466 -2.04467
H  -2.747508 -0.470276 1.605077
H  -1.430452 0.694225 1.641928
H  -3.707532 0.208059 -1.983635
H  -2.628141 -1.084839 -1.506769
H  -4.098745 -0.785472 -0.58222
H  -6.872161 5.570373 -0.146873
H  -6.449595 6.700222 -1.42949
H  -5.460862 6.610476 0.02535
H  -3.448388 4.871508 -2.699848
H  -4.415626 6.328774 -2.845145
H  -3.339195 6.123645 -1.465296
H  -1.391805 -2.068019 0.315975
H  0.766518 -0.042839 1.077402
H  0.25746 -3.82286 0.742174
H  1.607917 -4.030707 -0.367665
H  0.139203 -3.218376 -0.897679
H  2.878862 -0.660347 0.801437
H  6.886567 -1.691628 -0.192298
H  6.104821 -3.143637 -0.809926
H  7.268582 -4.284868 3.104221
elementType: O C H
totalener: -853.24721661 hartree
nucrepener: 1394.93228984 hartree
electener: -2248.17950645 hartree
oneelecener: -3924.23813631 hartree
twoeener: 1676.05862986 hartree
cpcmener: -0.02213555 hartree
kineticenergy: 849.13711679 hartree
xcener: -85.603889291404 hartree
chargesum: 0.0000000
charge: -0.279504 -0.465944 0.122556 -0.190994 -0.114763 -0.163057 0.074696 -0.130657 -0.329613 -0.295146 -0.304448 -0.138911 -0.137620 0.011417 -0.262528 -0.178299 0.464330 0.031391 -0.419232 0.034212 0.041388 0.070365 0.071922 0.065507 0.064150 0.065172 0.069524 0.025539 0.094483 0.081694 0.094927 0.092829 0.085528 0.086928 0.089507 0.079868 0.090000 0.090039 0.082962 0.129527 0.110976 0.109940 0.106319 0.102580 0.117311 0.135466 0.136482 0.281183
qa: -0.2795 -0.4659 0.1226 -0.1910 -0.1148 -0.1631 0.0747 -0.1307 -0.3296 -0.2951 -0.3044 -0.1389 -0.1376 0.0114 -0.2625 -0.1783 0.4643 0.0314 -0.4192 0.0342 0.0414 0.0704 0.0719 0.0655 0.0642 0.0652 0.0695 0.0255 0.0945 0.0817 0.0949 0.0928 0.0855 0.0869 0.0895 0.0799 0.0900 0.0900 0.0830 0.1295 0.1110 0.1099 0.1063 0.1026 0.1173 0.1355 0.1365 0.2812
va: 2.1249 2.0376 3.7656 3.9339 3.8621 3.8902 3.8170 3.9319 3.9568 3.9320 3.9286 3.8787 3.9052 3.7276 3.9314 3.7820 4.1631 3.9125 3.7205 3.6406 1.0246 1.0106 1.0110 1.0093 1.0118 1.0121 1.0117 1.0184 1.0059 1.0163 1.0033 1.0017 1.0010 1.0051 1.0051 1.0034 1.0021 1.0046 1.0024 0.9951 1.0235 0.9956 1.0316 0.9962 1.0307 0.9890 1.0006 0.9488
dispcorr: -0.018035842 hartree
energy: -853.265252452064
dipole: -48.53083 47.56214 -0.96869 32.49117 -31.47892 1.01225 -8.74788 8.59091 -0.15697
magnitude: 1.40984 au
magnitude: 3.58353 debye
