program: Orca
programVersion: 5.0.2
elementType: O O C C C C C C C C C C C C C C C C C C H H H H H H H H H H H H H H H H H H H H H H H H H H H H
charge: 0
multiplicity: 1
keywords: wb97x-d3
keywords: def2-TZVPP
keywords: def2/J RIJCOSX
keywords: DEFGRID2
keywords: scfconv7
keywords: smallprint printgap noloewdin
keywords: NOSOSCF
formula: C18H28O2
InChI: InChI=1/C18H28O2/c1-6-13-20-18(19)14-17(5)12-8-11-16(4)10-7-9-15(2)3/h1,8,12,14-16H,7,9-11,13H2,2-5H3
48 atoms
O  3.878819 -0.46317 0.342703
O  3.341148 -2.40665 -0.616739
C  -4.21658 -0.435796 0.056966
C  -3.619856 0.522121 -0.979335
C  -3.008196 1.802421 -0.419743
C  -2.341324 2.637396 -1.508653
C  -1.620413 3.902197 -1.029553
C  -3.180927 -0.912083 1.088832
C  -5.424634 0.156752 0.773233
C  -2.572892 4.908324 -0.391979
C  -0.457386 3.585171 -0.094153
C  -1.9668 -1.513733 0.47036
C  -0.725069 -1.049013 0.648301
C  0.486461 -1.621472 0.069193
C  0.335933 -2.817446 -0.814871
C  1.651374 -1.009662 0.377986
C  2.996406 -1.402703 -0.037564
C  5.251127 -0.696397 0.049062
C  5.834937 -1.703014 0.926199
C  6.332145 -2.512884 1.660282
H  -4.559132 -1.320699 -0.492265
H  -2.853071 -0.010678 -1.5524
H  -4.400352 0.781619 -1.702864
H  -3.779083 2.393165 0.083545
H  -2.270132 1.549223 0.34598
H  -3.094022 2.92112 -2.252797
H  -1.618634 2.007351 -2.03944
H  -1.198666 4.374493 -1.924234
H  -3.660593 -1.666214 1.723066
H  -2.897436 -0.088953 1.750238
H  -6.183722 0.489143 0.062316
H  -5.892651 -0.578579 1.431008
H  -5.152981 1.015479 1.390578
H  -2.062605 5.848599 -0.172874
H  -2.985004 4.539346 0.549717
H  -3.413186 5.139278 -1.05059
H  0.224402 2.853017 -0.533224
H  0.124825 4.482542 0.125393
H  -0.799439 3.183531 0.862032
H  -2.136658 -2.380032 -0.163311
H  -0.583998 -0.178542 1.283573
H  -0.363573 -2.599458 -1.623791
H  -0.085234 -3.653187 -0.252407
H  1.269068 -3.145758 -1.25586
H  1.607711 -0.128829 1.008469
H  5.747716 0.261512 0.20512
H  5.393996 -0.974436 -0.997601
H  6.76807 -3.233581 2.315121
elementType: O C H
totalener: -853.24552185 hartree
nucrepener: 1493.43949873 hartree
electener: -2346.68502058 hartree
oneelecener: -4121.33682682 hartree
twoeener: 1774.65180624 hartree
cpcmener: -0.02207415 hartree
kineticenergy: 849.14776904 hartree
xcener: -85.610099862532 hartree
chargesum: -0.0000000
charge: -0.278956 -0.466446 0.088340 -0.162730 -0.182541 -0.152339 0.083744 -0.149220 -0.332910 -0.316992 -0.319730 -0.111450 -0.161072 0.025017 -0.261998 -0.184834 0.467454 0.028798 -0.418334 0.034583 0.056567 0.077496 0.086220 0.088861 0.061581 0.075403 0.074428 0.036727 0.100648 0.081666 0.094013 0.095856 0.082870 0.094050 0.079422 0.091391 0.092370 0.096504 0.078968 0.127508 0.111616 0.102938 0.108583 0.106864 0.115826 0.135196 0.136919 0.281125
qa: -0.2790 -0.4664 0.0883 -0.1627 -0.1825 -0.1523 0.0837 -0.1492 -0.3329 -0.3170 -0.3197 -0.1114 -0.1611 0.0250 -0.2620 -0.1848 0.4675 0.0288 -0.4183 0.0346 0.0566 0.0775 0.0862 0.0889 0.0616 0.0754 0.0744 0.0367 0.1006 0.0817 0.0940 0.0959 0.0829 0.0940 0.0794 0.0914 0.0924 0.0965 0.0790 0.1275 0.1116 0.1029 0.1086 0.1069 0.1158 0.1352 0.1369 0.2811
va: 2.1244 2.0384 3.7840 3.8871 3.8751 3.8757 3.8174 3.9230 3.9526 3.9437 3.9443 3.8501 3.9026 3.7001 3.9260 3.7681 4.1715 3.9137 3.7173 3.6438 1.0131 1.0085 1.0088 0.9980 0.9971 1.0102 1.0112 1.0110 1.0058 1.0044 1.0032 1.0036 0.9975 1.0046 0.9979 1.0028 1.0032 1.0056 0.9972 1.0014 1.0212 0.9965 0.9960 1.0328 1.0325 0.9891 0.9999 0.9489
dispcorr: -0.020537188 hartree
energy: -853.266059035097
dipole: -36.47202 35.25677 -1.21525 20.65240 -19.98994 0.66246 -2.97568 3.14529 0.16961
magnitude: 1.39444 au
magnitude: 3.54438 debye
