program: Orca
programVersion: 5.0.2
elementType: O O C C C C C C C C C C C C C C C C C C H H H H H H H H H H H H H H H H H H H H H H H H H H H H
charge: 0
multiplicity: 1
keywords: wb97x-d3
keywords: def2-TZVPP
keywords: def2/J RIJCOSX
keywords: DEFGRID2
keywords: scfconv7
keywords: smallprint printgap noloewdin
keywords: NOSOSCF
formula: C18H28O2
InChI: InChI=1/C18H28O2/c1-6-13-20-18(19)14-17(5)12-8-11-16(4)10-7-9-15(2)3/h1,8,12,14-16H,7,9-11,13H2,2-5H3
48 atoms
O  3.319195 -1.433007 -0.852923
O  2.718918 -1.211218 1.286341
C  -4.425301 -0.15751 -0.48619
C  -3.533862 0.984277 -0.99985
C  -2.472671 1.526579 -0.0415
C  -1.487068 2.446324 -0.755276
C  -0.376808 3.021902 0.128055
C  -3.777984 -1.547907 -0.662914
C  -4.924204 0.070662 0.936345
C  0.601743 1.94939 0.598619
C  0.372121 4.126337 -0.610252
C  -2.522228 -1.737806 0.113499
C  -1.308551 -1.855257 -0.436544
C  -0.057397 -1.838678 0.312806
C  -0.130311 -1.938608 1.80381
C  1.076911 -1.671688 -0.402497
C  2.411366 -1.43113 0.137223
C  4.665256 -1.137206 -0.501226
C  4.848074 0.26201 -0.135411
C  5.024498 1.414656 0.151305
H  -5.308485 -0.177909 -1.133438
H  -3.045635 0.650436 -1.92249
H  -4.178147 1.817978 -1.297925
H  -2.955433 2.080963 0.769714
H  -1.93263 0.705806 0.432055
H  -2.046331 3.273791 -1.207031
H  -1.026757 1.903863 -1.590548
H  -0.845585 3.468818 1.013665
H  -3.584199 -1.713629 -1.725952
H  -4.509795 -2.301934 -0.351988
H  -4.117152 0.079588 1.670694
H  -5.448356 1.024793 1.021048
H  -5.625533 -0.711821 1.233698
H  1.384397 2.377981 1.228146
H  1.093639 1.470208 -0.252021
H  0.114532 1.16791 1.183638
H  0.854418 3.740178 -1.512172
H  -0.298748 4.932059 -0.915682
H  1.151923 4.567925 0.013731
H  -2.621103 -1.721052 1.194669
H  -1.221424 -1.852257 -1.519688
H  -0.858058 -2.695043 2.098781
H  -0.463523 -0.99071 2.234738
H  0.820068 -2.191815 2.259829
H  1.001723 -1.650106 -1.483697
H  5.253125 -1.366251 -1.390125
H  5.017782 -1.787546 0.302992
H  5.175369 2.437781 0.414805
elementType: O C H
totalener: -853.24168823 hartree
nucrepener: 1572.95679269 hartree
electener: -2426.19848092 hartree
oneelecener: -4280.77983267 hartree
twoeener: 1854.58135175 hartree
cpcmener: -0.02296743 hartree
kineticenergy: 849.14714852 hartree
xcener: -85.610523919445 hartree
chargesum: -0.0000000
charge: -0.280267 -0.467239 0.081977 -0.203845 -0.112533 -0.157101 0.105036 -0.126006 -0.323491 -0.322898 -0.297003 -0.108735 -0.172703 0.024011 -0.268123 -0.204635 0.478486 0.033346 -0.408251 0.021438 0.052489 0.070684 0.090319 0.075732 0.038359 0.074072 0.063738 0.023462 0.083502 0.094157 0.078171 0.098830 0.097477 0.097916 0.078652 0.085036 0.081120 0.087029 0.088785 0.134824 0.111256 0.110358 0.115037 0.109753 0.116656 0.135137 0.137659 0.278323
qa: -0.2803 -0.4672 0.0820 -0.2038 -0.1125 -0.1571 0.1050 -0.1260 -0.3235 -0.3229 -0.2970 -0.1087 -0.1727 0.0240 -0.2681 -0.2046 0.4785 0.0333 -0.4083 0.0214 0.0525 0.0707 0.0903 0.0757 0.0384 0.0741 0.0637 0.0235 0.0835 0.0942 0.0782 0.0988 0.0975 0.0979 0.0787 0.0850 0.0811 0.0870 0.0888 0.1348 0.1113 0.1104 0.1150 0.1098 0.1167 0.1351 0.1377 0.2783
va: 2.1211 2.0214 3.7820 3.9393 3.8330 3.8887 3.8069 3.9349 3.9597 3.9634 3.9299 3.8292 3.8907 3.6794 3.9261 3.7807 4.1261 3.9134 3.6979 3.6647 1.0130 1.0094 1.0042 1.0111 1.0144 1.0104 1.0131 1.0188 1.0145 1.0073 0.9955 1.0017 1.0050 1.0074 0.9967 0.9967 1.0030 1.0056 1.0053 0.9925 1.0229 0.9987 0.9920 1.0229 1.0324 0.9893 0.9989 0.9514
dispcorr: -0.023997567 hartree
energy: -853.265685797109
dipole: -25.99541 24.78163 -1.21378 15.07581 -15.24084 -0.16502 0.96608 -1.55867 -0.59259
magnitude: 1.36075 au
magnitude: 3.45876 debye
