program: Orca
programVersion: 5.0.2
elementType: O O C C C C C C C C C C C C C C C C C C H H H H H H H H H H H H H H H H H H H H H H H H H H H H
charge: 0
multiplicity: 1
keywords: wb97x-d3
keywords: def2-TZVPP
keywords: def2/J RIJCOSX
keywords: DEFGRID2
keywords: scfconv7
keywords: smallprint printgap noloewdin
keywords: NOSOSCF
formula: C18H28O2
InChI: InChI=1/C18H28O2/c1-6-13-20-18(19)14-17(5)12-8-11-16(4)10-7-9-15(2)3/h1,8,12,14-16H,7,9-11,13H2,2-5H3
48 atoms
O  3.575659 -1.256013 1.090241
O  3.114642 -2.256483 -0.853098
C  -4.25822 -0.227767 -0.413493
C  -3.347316 0.798445 -1.094938
C  -2.658616 1.798271 -0.171192
C  -1.672168 2.674743 -0.936482
C  -0.82693 3.630575 -0.088142
C  -3.511899 -1.099605 0.613827
C  -5.474807 0.418572 0.237959
C  -1.678234 4.64624 0.666127
C  0.105691 2.887622 0.864569
C  -2.26071 -1.694399 0.065393
C  -1.041003 -1.438431 0.551394
C  0.218411 -1.918585 -0.008325
C  0.150376 -2.853278 -1.172405
C  1.349172 -1.463614 0.575292
C  2.725795 -1.725446 0.161048
C  4.968109 -1.385167 0.826944
C  5.424081 -0.415607 -0.160845
C  5.800688 0.399189 -0.95817
H  -4.621557 -0.896016 -1.202927
H  -2.58022 0.263517 -1.665359
H  -3.937652 1.344474 -1.838963
H  -3.4063 2.422596 0.326288
H  -2.130646 1.262931 0.622535
H  -2.21978 3.257825 -1.685405
H  -0.992957 2.025682 -1.500666
H  -0.196255 4.188249 -0.789946
H  -4.186151 -1.903836 0.928485
H  -3.285494 -0.517423 1.511305
H  -6.156666 -0.334231 0.639021
H  -5.193369 1.07372 1.064865
H  -6.036526 1.01854 -0.480901
H  -2.35999 5.175539 -0.003409
H  -1.053971 5.396626 1.155725
H  -2.281531 4.173018 1.443934
H  -0.443009 2.370897 1.655186
H  0.705334 2.140584 0.339238
H  0.798332 3.576496 1.352722
H  -2.378782 -2.33925 -0.801329
H  -0.956274 -0.781769 1.413193
H  -0.493467 -3.701221 -0.932907
H  1.11751 -3.237555 -1.473389
H  -0.296783 -2.353051 -2.034326
H  1.246825 -0.817663 1.43995
H  5.223557 -2.399539 0.512666
H  5.462536 -1.20219 1.781348
H  6.135556 1.118918 -1.670848
elementType: O C H
totalener: -853.24484786 hartree
nucrepener: 1518.97306722 hartree
electener: -2372.21791508 hartree
oneelecener: -4172.52888450 hartree
twoeener: 1800.31096942 hartree
cpcmener: -0.02206325 hartree
kineticenergy: 849.14875318 hartree
xcener: -85.610148296732 hartree
chargesum: 0.0000000
charge: -0.279140 -0.466744 0.081836 -0.157084 -0.190912 -0.151441 0.084159 -0.144602 -0.332740 -0.317396 -0.322509 -0.107387 -0.172836 0.040883 -0.261125 -0.199239 0.470173 0.029733 -0.417636 0.033570 0.055583 0.077187 0.088183 0.090832 0.064046 0.077372 0.074148 0.037549 0.098634 0.079070 0.095030 0.083087 0.094460 0.091647 0.094622 0.079871 0.078293 0.091370 0.098358 0.128961 0.113508 0.104728 0.105333 0.108318 0.117536 0.136532 0.135090 0.281087
qa: -0.2791 -0.4667 0.0818 -0.1571 -0.1909 -0.1514 0.0842 -0.1446 -0.3327 -0.3174 -0.3225 -0.1074 -0.1728 0.0409 -0.2611 -0.1992 0.4702 0.0297 -0.4176 0.0336 0.0556 0.0772 0.0882 0.0908 0.0640 0.0774 0.0741 0.0375 0.0986 0.0791 0.0950 0.0831 0.0945 0.0916 0.0946 0.0799 0.0783 0.0914 0.0984 0.1290 0.1135 0.1047 0.1053 0.1083 0.1175 0.1365 0.1351 0.2811
va: 2.1237 2.0375 3.7970 3.8788 3.8748 3.8706 3.8134 3.9255 3.9543 3.9435 3.9475 3.8404 3.9048 3.6678 3.9286 3.7695 4.1662 3.9144 3.7197 3.6442 1.0128 1.0088 1.0078 0.9992 0.9973 1.0099 1.0117 1.0111 1.0073 1.0053 1.0038 0.9975 1.0029 1.0026 1.0046 0.9974 0.9973 1.0022 1.0066 1.0007 1.0194 0.9964 1.0306 0.9962 1.0314 1.0008 0.9893 0.9490
dispcorr: -0.021313008 hartree
energy: -853.266160871802
dipole: -32.31593 31.12282 -1.19311 18.95009 -18.74371 0.20638 0.23633 0.29244 0.52877
magnitude: 1.32125 au
magnitude: 3.35835 debye
