program: Orca
programVersion: 5.0.2
elementType: O O C C C C C C C C C C C C C C C C C C H H H H H H H H H H H H H H H H H H H H H H H H H H H H
charge: 0
multiplicity: 1
keywords: wb97x-d3
keywords: def2-TZVPP
keywords: def2/J RIJCOSX
keywords: DEFGRID2
keywords: scfconv7
keywords: smallprint printgap noloewdin
keywords: NOSOSCF
formula: C18H28O2
InChI: InChI=1/C18H28O2/c1-6-13-20-18(19)14-17(5)12-8-11-16(4)10-7-9-15(2)3/h1,8,12,14-16H,7,9-11,13H2,2-5H3
48 atoms
O  3.595733 -1.285672 1.101196
O  3.122907 -2.217126 -0.872363
C  -4.261309 -0.23778 -0.400628
C  -3.365273 0.791561 -1.096832
C  -2.68276 1.806163 -0.184891
C  -1.708611 2.686688 -0.960938
C  -0.875128 3.661738 -0.12297
C  -3.499013 -1.092859 0.628901
C  -5.479167 0.40255 0.254619
C  -1.739324 4.676605 0.617803
C  0.064015 2.940431 0.840171
C  -2.246041 -1.681723 0.077899
C  -1.025367 -1.413503 0.554941
C  0.23328 -1.895498 -0.0046
C  0.164045 -2.83808 -1.162377
C  1.366318 -1.441338 0.574922
C  2.740323 -1.712779 0.157324
C  4.985886 -1.436743 0.838187
C  5.464537 -0.4605 -0.132091
C  5.862876 0.354588 -0.91819
H  -4.623846 -0.916221 -1.181652
H  -2.595411 0.259712 -1.666311
H  -3.965284 1.324823 -1.842246
H  -3.434661 2.426506 0.31103
H  -2.1455 1.282625 0.610321
H  -2.264431 3.255201 -1.714979
H  -1.021825 2.040365 -1.518974
H  -0.249496 4.218299 -0.830179
H  -4.163124 -1.900719 0.9556
H  -3.272097 -0.500391 1.519457
H  -6.152751 -0.353241 0.663804
H  -5.197424 1.064101 1.076218
H  -6.049608 0.994528 -0.463903
H  -2.426801 5.188514 -0.059323
H  -1.124698 5.440878 1.097934
H  -2.337506 4.206253 1.401201
H  0.744833 3.643032 1.325279
H  -0.480895 2.423055 1.632887
H  0.675791 2.196976 0.323743
H  -2.364563 -2.33602 -0.781619
H  -0.939786 -0.748571 1.410319
H  -0.274762 -2.341384 -2.030598
H  -0.486478 -3.679915 -0.919549
H  1.129972 -3.231602 -1.455094
H  1.269813 -0.794402 1.439628
H  5.221666 -2.450609 0.506787
H  5.481808 -1.280501 1.796513
H  6.217771 1.078086 -1.617844
elementType: O C H
totalener: -853.24489110 hartree
nucrepener: 1517.03253461 hartree
electener: -2370.27742572 hartree
oneelecener: -4168.64978801 hartree
twoeener: 1798.37236229 hartree
cpcmener: -0.02213668 hartree
kineticenergy: 849.15213408 hartree
xcener: -85.610775530617 hartree
chargesum: 0.0000000
charge: -0.279356 -0.465978 0.082940 -0.157377 -0.190419 -0.151486 0.084307 -0.145418 -0.333168 -0.317564 -0.322705 -0.107702 -0.171742 0.039580 -0.261134 -0.197742 0.467937 0.029490 -0.418486 0.035121 0.055578 0.077207 0.088157 0.090965 0.063408 0.077065 0.074223 0.037677 0.098879 0.079139 0.095246 0.083021 0.094391 0.091657 0.094626 0.079818 0.098115 0.078502 0.091814 0.128963 0.113443 0.109029 0.104154 0.104851 0.118352 0.136688 0.134906 0.281027
qa: -0.2794 -0.4660 0.0829 -0.1574 -0.1904 -0.1515 0.0843 -0.1454 -0.3332 -0.3176 -0.3227 -0.1077 -0.1717 0.0396 -0.2611 -0.1977 0.4679 0.0295 -0.4185 0.0351 0.0556 0.0772 0.0882 0.0910 0.0634 0.0771 0.0742 0.0377 0.0989 0.0791 0.0952 0.0830 0.0944 0.0917 0.0946 0.0798 0.0981 0.0785 0.0918 0.1290 0.1134 0.1090 0.1042 0.1049 0.1184 0.1367 0.1349 0.2810
va: 2.1241 2.0373 3.7958 3.8793 3.8750 3.8713 3.8136 3.9259 3.9545 3.9435 3.9473 3.8401 3.9027 3.6762 3.9304 3.7762 4.1632 3.9147 3.7190 3.6425 1.0128 1.0088 1.0079 0.9990 0.9974 1.0099 1.0117 1.0110 1.0073 1.0051 1.0038 0.9973 1.0029 1.0026 1.0046 0.9974 1.0065 0.9973 1.0021 1.0008 1.0194 0.9961 0.9963 1.0296 1.0309 1.0004 0.9893 0.9490
dispcorr: -0.021247458 hartree
energy: -853.266138560934
dipole: -32.60606 31.41994 -1.18612 19.00117 -18.83443 0.16674 0.14671 0.40298 0.54969
magnitude: 1.31789 au
magnitude: 3.34981 debye
