program: Orca
programVersion: 5.0.2
elementType: O O C C C C C C C C C C C C C C C C C C H H H H H H H H H H H H H H H H H H H H H H H H H H H H
charge: 0
multiplicity: 1
keywords: wb97x-d3
keywords: def2-TZVPP
keywords: def2/J RIJCOSX
keywords: DEFGRID2
keywords: scfconv7
keywords: smallprint printgap noloewdin
keywords: NOSOSCF
formula: C18H28O2
InChI: InChI=1/C18H28O2/c1-6-13-20-18(19)14-17(5)12-8-11-16(4)10-7-9-15(2)3/h1,8,12,14-16H,7,9-11,13H2,2-5H3
48 atoms
O  3.791959 -0.38606 0.30542
O  3.297461 -2.344473 -0.647027
C  -4.258509 -0.435428 0.042692
C  -3.6235 0.515852 -0.976849
C  -2.980194 1.772437 -0.399136
C  -2.233671 2.568677 -1.465579
C  -1.432444 3.772592 -0.957977
C  -3.246782 -0.955863 1.0783
C  -5.453761 0.185687 0.755977
C  -2.315846 4.819094 -0.287518
C  -0.28804 3.357356 -0.037573
C  -2.028293 -1.551817 0.462398
C  -0.789653 -1.086047 0.658095
C  0.428964 -1.631505 0.068264
C  0.296296 -2.823493 -0.823652
C  1.582485 -0.995899 0.371809
C  2.932382 -1.35155 -0.061506
C  5.1665 -0.578388 -0.006161
C  5.793237 -1.558662 0.871364
C  6.323798 -2.34302 1.609441
H  -4.622364 -1.302694 -0.520661
H  -2.866706 -0.034158 -1.546747
H  -4.387687 0.805084 -1.706441
H  -3.744384 2.400133 0.068158
H  -2.285316 1.495134 0.39797
H  -2.948642 2.912295 -2.221544
H  -1.54644 1.894072 -1.988759
H  -0.984196 4.240502 -1.841998
H  -3.747274 -1.720554 1.682881
H  -2.964072 -0.155228 1.767105
H  -6.196643 0.548929 0.042994
H  -5.949385 -0.54172 1.402326
H  -5.160098 1.028906 1.384505
H  -1.746054 5.719168 -0.047215
H  -2.74432 4.45084 0.64716
H  -3.144207 5.120298 -0.932871
H  0.346898 2.59967 -0.502906
H  0.347746 4.210749 0.207228
H  -0.650925 2.946906 0.907257
H  -2.192312 -2.405136 -0.190189
H  -0.658336 -0.226795 1.310431
H  -0.394718 -2.604576 -1.639825
H  -0.12752 -3.664361 -0.271021
H  1.236425 -3.144033 -1.255416
H  1.524134 -0.120711 1.009043
H  5.634889 0.39582 0.135892
H  5.303844 -0.860046 -1.052601
H  6.79107 -3.04458 2.263804
elementType: O C H
totalener: -853.24522341 hartree
nucrepener: 1502.21149060 hartree
electener: -2355.45671401 hartree
oneelecener: -4138.88195858 hartree
twoeener: 1783.42524457 hartree
cpcmener: -0.02203132 hartree
kineticenergy: 849.14798667 hartree
xcener: -85.610146092273 hartree
chargesum: -0.0000000
charge: -0.278887 -0.466485 0.085336 -0.159400 -0.187651 -0.150714 0.083061 -0.148310 -0.332932 -0.316077 -0.320169 -0.107795 -0.167570 0.031960 -0.262518 -0.188307 0.467870 0.028503 -0.418755 0.035363 0.056923 0.076547 0.087143 0.090202 0.061624 0.076878 0.074025 0.036250 0.100227 0.080894 0.093750 0.095871 0.083416 0.094176 0.079569 0.091493 0.091734 0.096967 0.078625 0.128235 0.111548 0.103488 0.108254 0.106673 0.115764 0.135176 0.137017 0.281008
qa: -0.2789 -0.4665 0.0853 -0.1594 -0.1877 -0.1507 0.0831 -0.1483 -0.3329 -0.3161 -0.3202 -0.1078 -0.1676 0.0320 -0.2625 -0.1883 0.4679 0.0285 -0.4188 0.0354 0.0569 0.0765 0.0871 0.0902 0.0616 0.0769 0.0740 0.0363 0.1002 0.0809 0.0937 0.0959 0.0834 0.0942 0.0796 0.0915 0.0917 0.0970 0.0786 0.1282 0.1115 0.1035 0.1083 0.1067 0.1158 0.1352 0.1370 0.2810
va: 2.1241 2.0385 3.7899 3.8843 3.8763 3.8707 3.8173 3.9242 3.9530 3.9444 3.9457 3.8460 3.9051 3.6840 3.9260 3.7655 4.1736 3.9135 3.7183 3.6428 1.0129 1.0089 1.0084 0.9988 0.9973 1.0098 1.0117 1.0112 1.0063 1.0046 1.0031 1.0036 0.9972 1.0047 0.9975 1.0027 1.0026 1.0063 0.9975 1.0009 1.0206 0.9963 0.9962 1.0332 1.0325 0.9892 1.0000 0.9489
dispcorr: -0.020926314 hartree
energy: -853.266149721369
dipole: -35.58727 34.35741 -1.22986 19.83662 -19.18246 0.65415 -2.61473 2.77506 0.16032
magnitude: 1.40220 au
magnitude: 3.56412 debye
