program: Orca
programVersion: 5.0.2
elementType: O O C C C C C C C C C C C C C C C C C C H H H H H H H H H H H H H H H H H H H H H H H H H H H H
charge: 0
multiplicity: 1
keywords: wb97x-d3
keywords: def2-TZVPP
keywords: def2/J RIJCOSX
keywords: DEFGRID2
keywords: scfconv7
keywords: smallprint printgap noloewdin
keywords: NOSOSCF
formula: C18H28O2
InChI: InChI=1/C18H28O2/c1-6-13-20-18(19)14-17(5)12-8-11-16(4)10-7-9-15(2)3/h1,8,12,14-16H,7,9-11,13H2,2-5H3
48 atoms
O  4.458296 -3.416843 -0.227868
O  4.357155 -2.038819 1.525829
C  -2.494518 0.880137 -0.570002
C  -3.859789 0.991455 -1.25317
C  -4.43502 2.401093 -1.380959
C  -4.603449 3.123567 -0.050046
C  -5.231143 4.516093 -0.146816
C  -2.082582 -0.597714 -0.485798
C  -1.429608 1.708298 -1.27704
C  -6.661925 4.475712 -0.673042
C  -5.187762 5.207782 1.211531
C  -0.851472 -0.813365 0.325332
C  0.252664 -1.423879 -0.117729
C  1.478196 -1.620427 0.651978
C  1.509121 -1.107404 2.056093
C  2.489757 -2.262069 0.027207
C  3.827697 -2.525152 0.554156
C  5.791398 -3.766509 0.12549
C  6.739035 -2.704801 -0.188581
C  7.532768 -1.847233 -0.46305
H  -2.5868 1.248476 0.45843
H  -3.7863 0.550784 -2.253989
H  -4.575518 0.370083 -0.703592
H  -3.809653 3.005451 -2.046126
H  -5.403058 2.317238 -1.882593
H  -3.625081 3.223945 0.43115
H  -5.208613 2.506343 0.626013
H  -4.628799 5.109075 -0.846268
H  -1.951436 -1.007153 -1.492339
H  -2.904098 -1.156698 -0.022083
H  -0.454586 1.606774 -0.797065
H  -1.31592 1.397247 -2.319153
H  -1.674975 2.771372 -1.275908
H  -6.72325 4.078985 -1.687257
H  -7.101147 5.475232 -0.694893
H  -7.296654 3.853194 -0.036534
H  -5.772046 4.656959 1.953347
H  -4.16636 5.285019 1.590224
H  -5.595103 6.219643 1.160256
H  -0.887336 -0.429784 1.341567
H  0.266358 -1.796245 -1.138316
H  0.657853 -1.497905 2.616132
H  1.419116 -0.019061 2.065517
H  2.413226 -1.372548 2.590927
H  2.315146 -2.62648 -0.978775
H  6.023287 -4.654165 -0.463671
H  5.865057 -4.043009 1.179966
H  8.234591 -1.082371 -0.708818
elementType: O C H
totalener: -853.24709893 hartree
nucrepener: 1410.68850519 hartree
electener: -2263.93560412 hartree
oneelecener: -3955.77231161 hartree
twoeener: 1691.83670749 hartree
cpcmener: -0.02230631 hartree
kineticenergy: 849.14995141 hartree
xcener: -85.608057586884 hartree
chargesum: -0.0000000
charge: -0.279387 -0.465340 0.095084 -0.204256 -0.140502 -0.158990 0.066617 -0.113910 -0.332580 -0.300758 -0.290072 -0.150813 -0.132661 0.015174 -0.261136 -0.179660 0.464140 0.030485 -0.421692 0.037821 0.048874 0.080679 0.077071 0.070291 0.082704 0.070118 0.070776 0.026934 0.079151 0.094411 0.098183 0.087161 0.094486 0.089065 0.089468 0.081658 0.080377 0.086565 0.089220 0.123889 0.111514 0.103268 0.109746 0.105764 0.118734 0.134561 0.136777 0.280991
qa: -0.2794 -0.4653 0.0951 -0.2043 -0.1405 -0.1590 0.0666 -0.1139 -0.3326 -0.3008 -0.2901 -0.1508 -0.1327 0.0152 -0.2611 -0.1797 0.4641 0.0305 -0.4217 0.0378 0.0489 0.0807 0.0771 0.0703 0.0827 0.0701 0.0708 0.0269 0.0792 0.0944 0.0982 0.0872 0.0945 0.0891 0.0895 0.0817 0.0804 0.0866 0.0892 0.1239 0.1115 0.1033 0.1097 0.1058 0.1187 0.1346 0.1368 0.2810
va: 2.1243 2.0372 3.7260 3.9285 3.8824 3.8611 3.8276 3.9171 3.9546 3.9321 3.9260 3.8964 3.9108 3.7348 3.9317 3.7868 4.1607 3.9136 3.7171 3.6393 1.0195 1.0096 1.0086 1.0035 1.0124 1.0116 1.0117 1.0180 1.0181 1.0059 1.0036 1.0028 1.0007 1.0034 1.0046 1.0027 1.0032 1.0054 1.0053 1.0054 1.0237 0.9958 0.9959 1.0294 1.0303 0.9894 0.9999 0.9490
dispcorr: -0.018750165 hartree
energy: -853.265849093086
dipole: -49.06888 47.77348 -1.29540 31.55569 -31.60305 -0.04735 -2.87393 2.37393 -0.50000
magnitude: 1.38936 au
magnitude: 3.53146 debye
