program: Orca
programVersion: 5.0.2
elementType: O O C C C C C C C C C C C C C C C C C C H H H H H H H H H H H H H H H H H H H H H H H H H H H H
charge: 0
multiplicity: 1
keywords: wb97x-d3
keywords: def2-TZVPP
keywords: def2/J RIJCOSX
keywords: DEFGRID2
keywords: scfconv7
keywords: smallprint printgap noloewdin
keywords: NOSOSCF
formula: C18H28O2
InChI: InChI=1/C18H28O2/c1-6-13-20-18(19)14-17(5)12-8-11-16(4)10-7-9-15(2)3/h1,8,12,14-16H,7,9-11,13H2,2-5H3
48 atoms
O  3.34334 -1.448999 1.224836
O  2.925482 -1.421116 -0.967139
C  -4.399169 -0.094165 0.087843
C  -3.556904 1.127247 0.483331
C  -2.470461 1.531543 -0.509516
C  -1.626268 2.696585 -0.004578
C  -0.417746 3.043654 -0.878888
C  -3.740496 -1.427854 0.494344
C  -5.785475 -0.017363 0.719809
C  0.178879 4.381838 -0.456158
C  0.649524 1.953386 -0.836147
C  -2.4264 -1.67899 -0.157605
C  -1.256626 -1.734619 0.488835
C  0.046877 -1.821352 -0.160431
C  0.075611 -2.080283 -1.633489
C  1.131677 -1.612313 0.61806
C  2.515751 -1.496933 0.167813
C  4.730359 -1.281638 0.954698
C  5.045424 0.068312 0.503861
C  5.315426 1.182795 0.148397
H  -4.524282 -0.093745 -1.001871
H  -4.223511 1.98527 0.622653
H  -3.104814 0.943613 1.465505
H  -1.827763 0.677683 -0.724733
H  -2.936468 1.806993 -1.461811
H  -1.270577 2.47613 1.009513
H  -2.267202 3.580585 0.08894
H  -0.764238 3.141924 -1.915246
H  -4.424972 -2.238752 0.221057
H  -3.633639 -1.455063 1.583115
H  -6.321015 0.874992 0.391188
H  -6.396741 -0.883564 0.458974
H  -5.719314 0.022429 1.810002
H  1.032771 4.656261 -1.078937
H  0.526746 4.348248 0.579818
H  -0.553478 5.188623 -0.529828
H  0.281624 0.995588 -1.206254
H  1.513528 2.221202 -1.447835
H  1.008009 1.797651 0.185051
H  -2.451422 -1.77534 -1.239573
H  -1.250044 -1.613339 1.568544
H  -0.273276 -1.201295 -2.181686
H  -0.600718 -2.898076 -1.884859
H  1.062087 -2.331913 -2.004308
H  0.978236 -1.47083 1.681809
H  5.085898 -2.015914 0.22774
H  5.23575 -1.483867 1.899317
H  5.5566 2.173243 -0.166884
elementType: O C H
totalener: -853.24407630 hartree
nucrepener: 1548.17612041 hartree
electener: -2401.42019670 hartree
oneelecener: -4231.13835657 hartree
twoeener: 1829.71815986 hartree
cpcmener: -0.02272245 hartree
kineticenergy: 849.14998112 hartree
xcener: -85.608282898343 hartree
chargesum: -0.0000000
charge: -0.280303 -0.469226 0.082248 -0.186427 -0.095079 -0.160686 0.090446 -0.128590 -0.306986 -0.294449 -0.301045 -0.094272 -0.166662 0.010759 -0.266774 -0.200123 0.486686 0.031988 -0.413119 0.027418 0.043008 0.078610 0.068035 0.030619 0.069525 0.064154 0.073156 0.024318 0.091323 0.079861 0.089382 0.088818 0.087233 0.088937 0.080871 0.086483 0.070756 0.094671 0.082099 0.130228 0.111002 0.112086 0.112444 0.109612 0.115800 0.136337 0.135387 0.279439
qa: -0.2803 -0.4692 0.0822 -0.1864 -0.0951 -0.1607 0.0904 -0.1286 -0.3070 -0.2944 -0.3010 -0.0943 -0.1667 0.0108 -0.2668 -0.2001 0.4867 0.0320 -0.4131 0.0274 0.0430 0.0786 0.0680 0.0306 0.0695 0.0642 0.0732 0.0243 0.0913 0.0799 0.0894 0.0888 0.0872 0.0889 0.0809 0.0865 0.0708 0.0947 0.0821 0.1302 0.1110 0.1121 0.1124 0.1096 0.1158 0.1363 0.1354 0.2794
va: 2.1259 2.0224 3.7502 3.9123 3.8524 3.8906 3.8264 3.9392 3.9383 3.9281 3.9503 3.8507 3.8934 3.6893 3.9186 3.7783 4.1263 3.9145 3.7068 3.6534 1.0216 1.0061 1.0093 1.0301 1.0172 1.0121 1.0104 1.0172 1.0073 1.0129 1.0042 1.0047 1.0001 1.0053 1.0030 1.0055 1.0017 1.0081 1.0014 1.0014 1.0233 0.9905 0.9980 1.0265 1.0324 0.9999 0.9892 0.9505
dispcorr: -0.022614076 hartree
energy: -853.266690372717
dipole: -28.09352 26.85837 -1.23514 15.87518 -16.00521 -0.13003 -2.99237 3.44811 0.45574
magnitude: 1.32295 au
magnitude: 3.36266 debye
