program: Orca
programVersion: 5.0.2
elementType: O O C C C C C C C C C C C C C C C C C C H H H H H H H H H H H H H H H H H H H H H H H H H H H H
charge: 0
multiplicity: 1
keywords: wb97x-d3
keywords: def2-TZVPP
keywords: def2/J RIJCOSX
keywords: DEFGRID2
keywords: scfconv7
keywords: smallprint printgap noloewdin
keywords: NOSOSCF
formula: C18H28O2
InChI: InChI=1/C18H28O2/c1-6-13-20-18(19)14-17(5)12-8-11-16(4)10-7-9-15(2)3/h1,8,12,14-16H,7,9-11,13H2,2-5H3
48 atoms
O  4.370003 -2.452596 1.933573
O  4.49285 -1.613812 -0.132566
C  -3.116669 0.195735 0.47384
C  -3.154612 1.140336 -0.72948
C  -4.133723 2.299455 -0.582706
C  -4.144743 3.205517 -1.808433
C  -5.197032 4.315407 -1.784953
C  -2.38512 -1.118259 0.144665
C  -2.51913 0.857971 1.710053
C  -5.011405 5.264332 -0.605728
C  -5.177104 5.089824 -3.098407
C  -0.95169 -0.939207 -0.224772
C  0.071824 -1.417513 0.491069
C  1.483793 -1.284093 0.142174
C  1.825437 -0.504855 -1.087559
C  2.369444 -1.882874 0.968313
C  3.82211 -1.94238 0.818087
C  5.783894 -2.606864 1.958021
C  6.230731 -3.721784 1.1324
C  6.6074 -4.654874 0.47741
H  -4.150179 -0.085949 0.70742
H  -2.151726 1.540827 -0.91647
H  -3.423138 0.567058 -1.62412
H  -5.140943 1.901479 -0.413452
H  -3.883581 2.884162 0.306131
H  -4.308292 2.590226 -2.700293
H  -3.153428 3.658124 -1.932879
H  -6.181865 3.842085 -1.686744
H  -2.903726 -1.598872 -0.692342
H  -2.465454 -1.797711 0.99745
H  -1.509021 1.227468 1.519126
H  -3.118565 1.704885 2.046136
H  -2.459483 0.156551 2.545119
H  -4.018065 5.720867 -0.621162
H  -5.127451 4.760875 0.355005
H  -5.744543 6.073178 -0.632853
H  -5.335631 4.432103 -3.955508
H  -5.955996 5.854692 -3.123941
H  -4.218142 5.593813 -3.244248
H  -0.75605 -0.38679 -1.138758
H  -0.144094 -1.973618 1.399342
H  1.450545 -1.016826 -1.976452
H  2.889797 -0.349668 -1.215769
H  1.34041 0.472083 -1.059615
H  1.981059 -2.386295 1.846311
H  6.036453 -2.794682 3.001928
H  6.290127 -1.686741 1.657238
H  6.938389 -5.477988 -0.115125
elementType: O C H
totalener: -853.24698830 hartree
nucrepener: 1415.02500130 hartree
electener: -2268.27198960 hartree
oneelecener: -3964.44985651 hartree
twoeener: 1696.17786691 hartree
cpcmener: -0.02220250 hartree
kineticenergy: 849.15205577 hartree
xcener: -85.607971386765 hartree
chargesum: 0.0000000
charge: -0.278266 -0.465506 0.138712 -0.200588 -0.120564 -0.158335 0.074322 -0.137206 -0.340182 -0.305904 -0.297755 -0.142675 -0.141905 0.020759 -0.262335 -0.177696 0.462610 0.026931 -0.416651 0.034174 0.040775 0.066892 0.077721 0.061255 0.070918 0.067686 0.065200 0.026480 0.094926 0.086571 0.085777 0.097418 0.096433 0.083329 0.088872 0.091179 0.087636 0.089778 0.080342 0.129032 0.110736 0.110949 0.106679 0.101379 0.116844 0.134751 0.137280 0.281222
qa: -0.2783 -0.4655 0.1387 -0.2006 -0.1206 -0.1583 0.0743 -0.1372 -0.3402 -0.3059 -0.2978 -0.1427 -0.1419 0.0208 -0.2623 -0.1777 0.4626 0.0269 -0.4167 0.0342 0.0408 0.0669 0.0777 0.0613 0.0709 0.0677 0.0652 0.0265 0.0949 0.0866 0.0858 0.0974 0.0964 0.0833 0.0889 0.0912 0.0876 0.0898 0.0803 0.1290 0.1107 0.1109 0.1067 0.1014 0.1168 0.1348 0.1373 0.2812
va: 2.1247 2.0390 3.7315 3.9484 3.8821 3.8842 3.8179 3.9352 3.9607 3.9299 3.9339 3.8689 3.8905 3.7209 3.9306 3.7783 4.1692 3.9136 3.7158 3.6447 1.0167 1.0056 1.0097 1.0117 1.0048 1.0130 1.0114 1.0180 1.0057 1.0134 0.9977 1.0040 1.0036 1.0021 1.0020 1.0050 1.0048 1.0049 1.0033 0.9982 1.0241 0.9949 1.0304 0.9965 1.0313 0.9894 0.9995 0.9489
dispcorr: -0.018642965 hartree
energy: -853.265631263708
dipole: -46.13761 44.74011 -1.39750 31.65930 -31.45954 0.19976 -9.86537 10.30412 0.43876
magnitude: 1.47832 au
magnitude: 3.75758 debye
