program: Orca
programVersion: 5.0.2
elementType: O O C C C C C C C C C C C C C C C C C C H H H H H H H H H H H H H H H H H H H H H H H H H H H H
charge: 0
multiplicity: 1
keywords: wb97x-d3
keywords: def2-TZVPP
keywords: def2/J RIJCOSX
keywords: DEFGRID2
keywords: scfconv7
keywords: smallprint printgap noloewdin
keywords: NOSOSCF
formula: C18H28O2
InChI: InChI=1/C18H28O2/c1-6-13-20-18(19)14-17(5)12-8-11-16(4)10-7-9-15(2)3/h1,8,12,14-16H,7,9-11,13H2,2-5H3
48 atoms
O  3.861002 -2.589354 1.480537
O  3.677344 -1.780897 -0.59352
C  -3.741919 0.066071 0.297301
C  -2.945273 1.224183 0.908147
C  -3.18632 2.581069 0.245855
C  -2.503628 2.70598 -1.113039
C  -2.814135 3.991523 -1.881913
C  -3.093953 -1.29236 0.60993
C  -5.188598 0.078035 0.776182
C  -2.368697 5.23938 -1.127008
C  -2.169435 3.948366 -3.26329
C  -1.765099 -1.449899 -0.045476
C  -0.621548 -1.695752 0.602295
C  0.697292 -1.793627 -0.017117
C  0.785988 -1.623223 -1.499925
C  1.739381 -2.026471 0.810378
C  3.153414 -2.103097 0.447521
C  5.270349 -2.68861 1.315818
C  5.919519 -1.385929 1.386137
C  6.47655 -0.324946 1.464631
H  -3.746921 0.176232 -0.793652
H  -3.187741 1.284534 1.974721
H  -1.872952 1.008115 0.860674
H  -4.261171 2.763839 0.13739
H  -2.816705 3.364542 0.912481
H  -2.785592 1.854439 -1.741324
H  -1.418068 2.627463 -0.974712
H  -3.901199 4.047669 -2.018284
H  -3.75931 -2.083581 0.245538
H  -3.00664 -1.427184 1.692495
H  -5.781925 -0.689311 0.274955
H  -5.247437 -0.108358 1.85145
H  -5.671593 1.037699 0.583762
H  -2.558536 6.142398 -1.710995
H  -1.296701 5.206795 -0.913623
H  -2.890185 5.358165 -0.176222
H  -1.08038 3.890134 -3.187566
H  -2.504788 3.081237 -3.836373
H  -2.408985 4.83956 -3.847014
H  -1.761804 -1.328645 -1.125431
H  -0.650152 -1.807809 1.682759
H  0.517772 -0.602315 -1.780078
H  0.075136 -2.283168 -1.998744
H  1.772236 -1.830084 -1.897423
H  1.528213 -2.170694 1.863896
H  5.529045 -3.193973 0.383122
H  5.61456 -3.317512 2.136966
H  6.969493 0.619002 1.530959
elementType: O C H
totalener: -853.24619525 hartree
nucrepener: 1456.65700609 hartree
electener: -2309.90320135 hartree
oneelecener: -4047.79223871 hartree
twoeener: 1737.88903736 hartree
cpcmener: -0.02218307 hartree
kineticenergy: 849.14837006 hartree
xcener: -85.606904004335 hartree
chargesum: -0.0000000
charge: -0.279214 -0.466001 0.038573 -0.172341 -0.147030 -0.152959 0.065590 -0.110809 -0.307928 -0.303238 -0.291967 -0.122581 -0.150446 0.023993 -0.261555 -0.182041 0.465427 0.030888 -0.421046 0.036349 0.050457 0.085900 0.080031 0.066584 0.079794 0.072168 0.064383 0.027728 0.093179 0.079167 0.091609 0.082038 0.091784 0.089917 0.082651 0.089750 0.080577 0.087297 0.089604 0.119406 0.113106 0.110754 0.102876 0.106242 0.118069 0.136635 0.135384 0.281247
qa: -0.2792 -0.4660 0.0386 -0.1723 -0.1470 -0.1530 0.0656 -0.1108 -0.3079 -0.3032 -0.2920 -0.1226 -0.1504 0.0240 -0.2616 -0.1820 0.4654 0.0309 -0.4210 0.0363 0.0505 0.0859 0.0800 0.0666 0.0798 0.0722 0.0644 0.0277 0.0932 0.0792 0.0916 0.0820 0.0918 0.0899 0.0827 0.0897 0.0806 0.0873 0.0896 0.1194 0.1131 0.1108 0.1029 0.1062 0.1181 0.1366 0.1354 0.2812
va: 2.1249 2.0373 3.7725 3.9067 3.9023 3.8551 3.8269 3.9026 3.9462 3.9323 3.9289 3.8744 3.8934 3.7230 3.9293 3.7877 4.1623 3.9142 3.7220 3.6409 1.0202 1.0098 1.0086 1.0079 1.0077 1.0133 1.0137 1.0177 1.0049 1.0156 1.0038 1.0032 1.0041 1.0051 1.0024 1.0020 1.0035 1.0050 1.0052 1.0079 1.0225 0.9962 0.9961 1.0291 1.0304 1.0004 0.9890 0.9488
dispcorr: -0.019170666 hartree
energy: -853.265365917237
dipole: -38.29801 36.98125 -1.31676 24.93024 -25.11708 -0.18684 -9.55504 9.96357 0.40853
magnitude: 1.39128 au
magnitude: 3.53635 debye
