program: Orca
programVersion: 5.0.2
elementType: O O C C C C C C C C C C C C C C C C C C H H H H H H H H H H H H H H H H H H H H H H H H H H H H
charge: 0
multiplicity: 1
keywords: wb97x-d3
keywords: def2-TZVPP
keywords: def2/J RIJCOSX
keywords: DEFGRID2
keywords: scfconv7
keywords: smallprint printgap noloewdin
keywords: NOSOSCF
formula: C18H28O2
InChI: InChI=1/C18H28O2/c1-6-13-20-18(19)14-17(5)12-8-11-16(4)10-7-9-15(2)3/h1,8,12,14-16H,7,9-11,13H2,2-5H3
48 atoms
O  4.155252 -1.437869 1.663422
O  3.917172 -1.597355 -0.551015
C  -3.720611 -0.088693 0.223798
C  -3.132972 1.169768 0.869971
C  -3.558824 2.484861 0.217375
C  -2.891684 2.718443 -1.134207
C  -3.342673 3.97916 -1.874114
C  -2.890003 -1.334299 0.57125
C  -5.172641 -0.295846 0.637393
C  -3.038544 5.250388 -1.088631
C  -2.696404 4.037668 -3.254007
C  -1.534161 -1.307947 -0.046989
C  -0.383881 -1.360507 0.633219
C  0.950395 -1.343841 0.038699
C  1.04645 -1.196355 -1.446118
C  1.994758 -1.450207 0.889558
C  3.414941 -1.498829 0.544549
C  5.569623 -1.49494 1.515883
C  6.034966 -2.841651 1.21028
C  6.425613 -3.95417 0.983107
H  -3.693436 0.02436 -0.866381
H  -3.414637 1.175276 1.928765
H  -2.039085 1.121494 0.854564
H  -4.647975 2.517429 0.102433
H  -3.306756 3.304407 0.895503
H  -3.075214 1.856323 -1.783875
H  -1.804313 2.759831 -0.992945
H  -4.429248 3.918102 -2.012676
H  -3.421084 -2.218409 0.199843
H  -2.815261 -1.444443 1.657577
H  -5.621859 -1.139725 0.110025
H  -5.250397 -0.495988 1.709089
H  -5.784781 0.58214 0.423852
H  -3.317809 6.141132 -1.655355
H  -1.971288 5.327192 -0.863204
H  -3.578466 5.292099 -0.141634
H  -2.930068 3.149128 -3.844477
H  -3.036409 4.906811 -3.820912
H  -1.6078 4.102451 -3.176654
H  -1.518596 -1.233467 -1.131072
H  -0.424199 -1.435069 1.716577
H  2.063942 -1.089173 -1.801534
H  0.478946 -0.322547 -1.771615
H  0.604356 -2.061974 -1.944199
H  1.779646 -1.514088 1.950206
H  5.974155 -1.173292 2.475749
H  5.920651 -0.789944 0.758609
H  6.773637 -4.942521 0.77994
elementType: O C H
totalener: -853.24636770 hartree
nucrepener: 1448.98897993 hartree
electener: -2302.23534763 hartree
oneelecener: -4032.38615869 hartree
twoeener: 1730.15081106 hartree
cpcmener: -0.02211630 hartree
kineticenergy: 849.14241481 hartree
xcener: -85.606048943496 hartree
chargesum: 0.0000000
charge: -0.278735 -0.466605 0.042334 -0.174326 -0.147717 -0.152622 0.066544 -0.113135 -0.305757 -0.304604 -0.291588 -0.121256 -0.153661 0.023247 -0.261078 -0.180863 0.467805 0.030332 -0.418198 0.033950 0.050347 0.085276 0.080487 0.066256 0.079778 0.072304 0.063828 0.027664 0.094236 0.079503 0.091286 0.082450 0.091009 0.090100 0.082581 0.090355 0.086502 0.090374 0.080370 0.120197 0.113304 0.107734 0.101707 0.109331 0.116424 0.135307 0.136171 0.281051
qa: -0.2787 -0.4666 0.0423 -0.1743 -0.1477 -0.1526 0.0665 -0.1131 -0.3058 -0.3046 -0.2916 -0.1213 -0.1537 0.0232 -0.2611 -0.1809 0.4678 0.0303 -0.4182 0.0339 0.0503 0.0853 0.0805 0.0663 0.0798 0.0723 0.0638 0.0277 0.0942 0.0795 0.0913 0.0825 0.0910 0.0901 0.0826 0.0904 0.0865 0.0904 0.0804 0.1202 0.1133 0.1077 0.1017 0.1093 0.1164 0.1353 0.1362 0.2811
va: 2.1254 2.0376 3.7695 3.9073 3.9024 3.8565 3.8260 3.9035 3.9449 3.9322 3.9284 3.8703 3.8960 3.7140 3.9261 3.7762 4.1672 3.9144 3.7166 3.6428 1.0210 1.0101 1.0080 1.0081 1.0084 1.0138 1.0135 1.0176 1.0041 1.0159 1.0039 1.0029 1.0044 1.0050 1.0024 1.0016 1.0052 1.0051 1.0034 1.0070 1.0226 1.0315 0.9971 0.9957 1.0314 0.9890 1.0003 0.9489
dispcorr: -0.019075964 hartree
energy: -853.265443664482
dipole: -41.39262 40.08990 -1.30272 25.05853 -24.71574 0.34279 -9.72326 10.19701 0.47374
magnitude: 1.42794 au
magnitude: 3.62954 debye
