program: Orca
programVersion: 5.0.2
elementType: O O C C C C C C C C C C C C C C C C C C H H H H H H H H H H H H H H H H H H H H H H H H H H H H
charge: 0
multiplicity: 1
keywords: wb97x-d3
keywords: def2-TZVPP
keywords: def2/J RIJCOSX
keywords: DEFGRID2
keywords: scfconv7
keywords: smallprint printgap noloewdin
keywords: NOSOSCF
formula: C18H28O2
InChI: InChI=1/C18H28O2/c1-6-13-20-18(19)14-17(5)12-8-11-16(4)10-7-9-15(2)3/h1,8,12,14-16H,7,9-11,13H2,2-5H3
48 atoms
O  3.76628 -0.675628 1.20699
O  3.393931 -1.563309 -0.806486
C  -4.3560 -0.443872 0.24092
C  -3.96768 1.035966 0.333545
C  -2.892993 1.510562 -0.639079
C  -2.659204 3.014795 -0.559236
C  -1.551821 3.539708 -1.476633
C  -3.307528 -1.397219 0.839157
C  -5.689539 -0.675692 0.94549
C  -1.539419 5.064593 -1.476003
C  -0.178841 3.001446 -1.086498
C  -2.012673 -1.467755 0.106367
C  -0.811679 -1.315535 0.675219
C  0.466553 -1.384216 -0.024731
C  0.440495 -1.685438 -1.489113
C  1.575166 -1.144936 0.710651
C  2.961091 -1.16773 0.250641
C  5.162794 -0.65485 0.933836
C  5.751864 -1.986987 0.985403
C  6.250302 -3.077268 1.053682
H  -4.483523 -0.701172 -0.818106
H  -4.869522 1.634257 0.161634
H  -3.655884 1.257913 1.361188
H  -1.958801 0.98414 -0.444287
H  -3.185722 1.245283 -1.66131
H  -2.422086 3.293391 0.474995
H  -3.595211 3.530534 -0.80206
H  -1.770725 3.204324 -2.498008
H  -3.740156 -2.405316 0.834154
H  -3.135003 -1.141064 1.889264
H  -6.006375 -1.718116 0.875995
H  -5.623923 -0.422052 2.006559
H  -6.480145 -0.061854 0.510606
H  -0.77422 5.460163 -2.147194
H  -1.332076 5.45623 -0.476519
H  -2.499684 5.474465 -1.796026
H  0.602305 3.406275 -1.733254
H  0.072098 3.276609 -0.058374
H  -0.119544 1.914476 -1.158576
H  -2.08605 -1.671337 -0.958435
H  -0.762512 -1.104659 1.739901
H  0.040054 -2.686669 -1.661963
H  1.415361 -1.629354 -1.95739
H  -0.223291 -0.989648 -2.005068
H  1.444245 -0.900829 1.75873
H  5.600662 -0.02821 1.711156
H  5.373995 -0.181604 -0.028101
H  6.687625 -4.048959 1.109087
elementType: O C H
totalener: -853.24540668 hartree
nucrepener: 1492.10394488 hartree
electener: -2345.34935156 hartree
oneelecener: -4118.69510914 hartree
twoeener: 1773.34575758 hartree
cpcmener: -0.02223555 hartree
kineticenergy: 849.15233723 hartree
xcener: -85.608199904345 hartree
chargesum: -0.0000000
charge: -0.279792 -0.466981 0.086356 -0.187563 -0.054555 -0.174259 0.083461 -0.114021 -0.301438 -0.296925 -0.291432 -0.134232 -0.135817 -0.000368 -0.259391 -0.185552 0.473235 0.028993 -0.418121 0.033458 0.038525 0.071762 0.067948 0.017765 0.063082 0.064608 0.069733 0.023072 0.094926 0.079974 0.090005 0.084955 0.089051 0.089158 0.081071 0.086778 0.091943 0.082920 0.076875 0.129658 0.109546 0.115426 0.108613 0.097860 0.116209 0.135610 0.136771 0.281097
qa: -0.2798 -0.4670 0.0864 -0.1876 -0.0546 -0.1743 0.0835 -0.1140 -0.3014 -0.2969 -0.2914 -0.1342 -0.1358 -0.0004 -0.2594 -0.1856 0.4732 0.0290 -0.4181 0.0335 0.0385 0.0718 0.0679 0.0178 0.0631 0.0646 0.0697 0.0231 0.0949 0.0800 0.0900 0.0850 0.0891 0.0892 0.0811 0.0868 0.0919 0.0829 0.0769 0.1297 0.1095 0.1154 0.1086 0.0979 0.1162 0.1356 0.1368 0.2811
va: 2.1239 2.0364 3.7709 3.9266 3.8357 3.9216 3.8147 3.9069 3.9333 3.9284 3.9328 3.8999 3.8872 3.7151 3.9244 3.7772 4.1601 3.9131 3.7155 3.6459 1.0224 1.0077 1.0094 1.0423 1.0152 1.0106 1.0119 1.0182 1.0038 1.0152 1.0048 1.0010 1.0053 1.0052 1.0030 1.0052 1.0052 1.0037 1.0014 1.0025 1.0241 0.9963 1.0316 0.9950 1.0318 0.9893 0.9996 0.9489
dispcorr: -0.020289704 hartree
energy: -853.265696382350
dipole: -35.10156 33.77635 -1.32522 19.72222 -19.35632 0.36590 -5.83462 6.23232 0.39771
magnitude: 1.43117 au
magnitude: 3.63775 debye
