program: Orca
programVersion: 5.0.2
elementType: O O C C C C C C C C C C C C C C C C C C H H H H H H H H H H H H H H H H H H H H H H H H H H H H
charge: 0
multiplicity: 1
keywords: wb97x-d3
keywords: def2-TZVPP
keywords: def2/J RIJCOSX
keywords: DEFGRID2
keywords: scfconv7
keywords: smallprint printgap noloewdin
keywords: NOSOSCF
formula: C18H28O2
InChI: InChI=1/C18H28O2/c1-6-13-20-18(19)14-17(5)12-8-11-16(4)10-7-9-15(2)3/h1,8,12,14-16H,7,9-11,13H2,2-5H3
48 atoms
O  3.803525 -2.447869 1.534615
O  3.654372 -1.768674 -0.587431
C  -3.741331 0.053083 0.203668
C  -2.960409 1.125871 0.97263
C  -3.057387 2.528592 0.374384
C  -2.255644 2.678264 -0.915481
C  -2.1946 4.097897 -1.481209
C  -3.152802 -1.349047 0.437891
C  -5.218469 0.076152 0.576999
C  -1.241764 4.149898 -2.670319
C  -3.570176 4.620253 -1.880113
C  -1.805375 -1.497652 -0.180499
C  -0.677468 -1.732973 0.498266
C  0.659351 -1.808378 -0.085023
C  0.781605 -1.647945 -1.566486
C  1.683879 -2.007976 0.773061
C  3.109634 -2.050986 0.45448
C  5.22058 -2.498414 1.416385
C  5.81518 -1.167866 1.422574
C  6.314052 -0.076189 1.45308
H  -3.663676 0.259077 -0.870277
H  -3.319267 1.139681 2.007578
H  -1.901734 0.853205 1.029699
H  -4.106878 2.789365 0.206583
H  -2.6829 3.252363 1.105647
H  -2.655355 2.011582 -1.688419
H  -1.232289 2.334147 -0.725079
H  -1.794998 4.755589 -0.699232
H  -3.827676 -2.088044 -0.008366
H  -3.111163 -1.563669 1.510165
H  -5.79777 -0.616842 -0.036369
H  -5.363333 -0.206382 1.62275
H  -5.652351 1.068915 0.44287
H  -0.239749 3.812009 -2.397415
H  -1.148665 5.16316 -3.066671
H  -1.592947 3.510984 -3.484954
H  -4.031435 3.974025 -2.632064
H  -4.253908 4.678314 -1.031974
H  -3.502847 5.623108 -2.307085
H  -1.771678 -1.367991 -1.258829
H  -0.735696 -1.851511 1.576872
H  1.786517 -1.814262 -1.934984
H  0.474999 -0.642769 -1.864395
H  0.113518 -2.34402 -2.076031
H  1.446384 -2.140909 1.822381
H  5.5278 -3.049623 0.524783
H  5.564419 -3.060689 2.284796
H  6.752825 0.896326 1.475351
elementType: O C H
totalener: -853.24596988 hartree
nucrepener: 1465.68104422 hartree
electener: -2318.92701410 hartree
oneelecener: -4065.84608915 hartree
twoeener: 1746.91907505 hartree
cpcmener: -0.02207410 hartree
kineticenergy: 849.14560281 hartree
xcener: -85.606265607682 hartree
chargesum: 0.0000000
charge: -0.279324 -0.466378 0.039570 -0.176995 -0.139149 -0.152137 0.066673 -0.113883 -0.305443 -0.291535 -0.300519 -0.113976 -0.157869 0.022508 -0.259484 -0.182088 0.467927 0.030419 -0.419590 0.034189 0.051761 0.084023 0.082160 0.066513 0.074810 0.064771 0.067016 0.026787 0.092285 0.080087 0.091067 0.081966 0.091834 0.087463 0.089641 0.079566 0.081907 0.088718 0.090375 0.119970 0.114628 0.107411 0.107866 0.103639 0.117058 0.136822 0.135726 0.281217
qa: -0.2793 -0.4664 0.0396 -0.1770 -0.1391 -0.1521 0.0667 -0.1139 -0.3054 -0.2915 -0.3005 -0.1140 -0.1579 0.0225 -0.2595 -0.1821 0.4679 0.0304 -0.4196 0.0342 0.0518 0.0840 0.0822 0.0665 0.0748 0.0648 0.0670 0.0268 0.0923 0.0801 0.0911 0.0820 0.0918 0.0875 0.0896 0.0796 0.0819 0.0887 0.0904 0.1200 0.1146 0.1074 0.1079 0.1036 0.1171 0.1368 0.1357 0.2812
va: 2.1249 2.0378 3.7586 3.9064 3.9065 3.8630 3.8287 3.9049 3.9454 3.9288 3.9291 3.8623 3.8961 3.7135 3.9260 3.7788 4.1654 3.9118 3.7187 3.6432 1.0212 1.0102 1.0073 1.0074 1.0101 1.0135 1.0137 1.0182 1.0056 1.0151 1.0041 1.0030 1.0029 1.0052 1.0054 1.0036 1.0029 1.0026 1.0049 1.0065 1.0218 1.0307 0.9965 0.9963 1.0311 1.0002 0.9891 0.9488
dispcorr: -0.019423123 hartree
energy: -853.265393003656
dipole: -38.34997 37.09117 -1.25880 23.73762 -23.85703 -0.11941 -10.02497 10.46335 0.43838
magnitude: 1.33829 au
magnitude: 3.40167 debye
