program: Orca
programVersion: 5.0.2
elementType: O O C C C C C C C C C C C C C C C C C C H H H H H H H H H H H H H H H H H H H H H H H H H H H H
charge: 0
multiplicity: 1
keywords: wb97x-d3
keywords: def2-TZVPP
keywords: def2/J RIJCOSX
keywords: DEFGRID2
keywords: scfconv7
keywords: smallprint printgap noloewdin
keywords: NOSOSCF
formula: C18H28O2
InChI: InChI=1/C18H28O2/c1-6-13-20-18(19)14-17(5)12-8-11-16(4)10-7-9-15(2)3/h1,8,12,14-16H,7,9-11,13H2,2-5H3
48 atoms
O  4.093945 -1.294935 1.696735
O  3.915916 -1.615755 -0.504371
C  -3.695284 -0.102278 0.12813
C  -3.105197 1.082929 0.898923
C  -3.435767 2.455807 0.31596
C  -2.70143 2.738217 -0.99106
C  -2.8470 4.166385 -1.518079
C  -2.923023 -1.398267 0.426877
C  -5.17388 -0.285644 0.448641
C  -1.958149 4.36975 -2.740425
C  -4.294199 4.514432 -1.848565
C  -1.551123 -1.386123 -0.154653
C  -0.419155 -1.428594 0.556391
C  0.930104 -1.406993 -0.002722
C  1.063733 -1.315613 -1.489222
C  1.953545 -1.450569 0.878414
C  3.382611 -1.462677 0.569738
C  5.511983 -1.306999 1.577818
C  6.031077 -2.647706 1.338587
C  6.469735 -3.751365 1.161681
H  -3.604215 0.089799 -0.9473
H  -3.457008 1.028107 1.935175
H  -2.01554 0.990062 0.949293
H  -4.516513 2.554046 0.177114
H  -3.158266 3.222192 1.047176
H  -3.035858 2.043253 -1.769678
H  -1.635981 2.529122 -0.840663
H  -2.503266 4.851657 -0.733244
H  -3.475146 -2.239517 -0.006877
H  -2.883491 -1.567649 1.507258
H  -5.622987 -1.069107 -0.164873
H  -5.315922 -0.563225 1.496242
H  -5.742355 0.629442 0.273192
H  -2.26059 3.714318 -3.561343
H  -0.911843 4.152237 -2.515269
H  -2.007615 5.397181 -3.106761
H  -4.70459 3.821612 -2.588403
H  -4.941289 4.479176 -0.970856
H  -4.372908 5.521064 -2.264526
H  -1.506732 -1.319786 -1.238288
H  -0.487682 -1.489282 1.639214
H  2.090038 -1.227197 -1.823367
H  0.509525 -0.451942 -1.860987
H  0.628435 -2.19678 -1.964773
H  1.713231 -1.475564 1.9353
H  5.885754 -0.930575 2.530061
H  5.851402 -0.621998 0.797382
H  6.863302 -4.728113 0.988203
elementType: O C H
totalener: -853.24627109 hartree
nucrepener: 1454.34249392 hartree
electener: -2307.58876501 hartree
oneelecener: -4043.09322857 hartree
twoeener: 1735.50446356 hartree
cpcmener: -0.02207911 hartree
kineticenergy: 849.14971727 hartree
xcener: -85.607367264085 hartree
chargesum: -0.0000000
charge: -0.279841 -0.465644 0.047500 -0.181311 -0.141225 -0.147521 0.065298 -0.115470 -0.305167 -0.290191 -0.302225 -0.114549 -0.160941 0.022634 -0.260691 -0.180357 0.467859 0.030379 -0.416925 0.032534 0.051102 0.083815 0.082273 0.065947 0.074645 0.063974 0.066555 0.026432 0.092958 0.080432 0.091680 0.082262 0.091727 0.079432 0.087144 0.089364 0.082462 0.089601 0.090547 0.120457 0.114833 0.107820 0.101727 0.108781 0.117134 0.134767 0.136766 0.281217
qa: -0.2798 -0.4656 0.0475 -0.1813 -0.1412 -0.1475 0.0653 -0.1155 -0.3052 -0.2902 -0.3022 -0.1145 -0.1609 0.0226 -0.2607 -0.1804 0.4679 0.0304 -0.4169 0.0325 0.0511 0.0838 0.0823 0.0659 0.0746 0.0640 0.0666 0.0264 0.0930 0.0804 0.0917 0.0823 0.0917 0.0794 0.0871 0.0894 0.0825 0.0896 0.0905 0.1205 0.1148 0.1078 0.1017 0.1088 0.1171 0.1348 0.1368 0.2812
va: 2.1249 2.0378 3.7564 3.9124 3.9054 3.8597 3.8303 3.9053 3.9436 3.9288 3.9293 3.8630 3.8988 3.7152 3.9262 3.7812 4.1632 3.9139 3.7159 3.6467 1.0219 1.0110 1.0068 1.0069 1.0102 1.0137 1.0133 1.0184 1.0050 1.0154 1.0041 1.0027 1.0031 1.0038 1.0050 1.0055 1.0025 1.0024 1.0050 1.0062 1.0217 1.0318 0.9966 0.9962 1.0311 0.9893 0.9997 0.9489
dispcorr: -0.019227771 hartree
energy: -853.265498863899
dipole: -41.92799 40.68015 -1.24784 23.98205 -23.56050 0.42155 -10.62420 11.07802 0.45383
magnitude: 1.39312 au
magnitude: 3.54102 debye
