program: Orca
programVersion: 5.0.2
elementType: O O C C C C C C C C C C C C C C C C C C H H H H H H H H H H H H H H H H H H H H H H H H H H H H
charge: 0
multiplicity: 1
keywords: wb97x-d3
keywords: def2-TZVPP
keywords: def2/J RIJCOSX
keywords: DEFGRID2
keywords: scfconv7
keywords: smallprint printgap noloewdin
keywords: NOSOSCF
formula: C18H28O2
InChI: InChI=1/C18H28O2/c1-6-13-20-18(19)14-17(5)12-8-11-16(4)10-7-9-15(2)3/h1,8,12,14-16H,7,9-11,13H2,2-5H3
48 atoms
O  3.309454 -1.398376 1.230723
O  2.89863 -1.405463 -0.963223
C  -4.390088 -0.080988 0.078815
C  -3.521028 1.114616 0.49621
C  -2.438043 1.525045 -0.498625
C  -1.559371 2.651824 0.034313
C  -0.359469 3.009537 -0.847398
C  -3.762889 -1.434581 0.469236
C  -5.777761 0.016015 0.704426
C  0.268679 4.319657 -0.38387
C  0.689408 1.90073 -0.864945
C  -2.446504 -1.693644 -0.173686
C  -1.28163 -1.757982 0.480396
C  0.024897 -1.837505 -0.16278
C  0.063838 -2.100132 -1.635009
C  1.103725 -1.612306 0.619379
C  2.486429 -1.475919 0.171724
C  4.69364 -1.208129 0.962177
C  4.982651 0.136337 0.479201
C  5.236074 1.247707 0.101354
H  -4.509446 -0.062746 -1.011377
H  -4.169523 1.981049 0.665479
H  -3.061787 0.89841 1.468434
H  -1.819428 0.663951 -0.75313
H  -2.910552 1.844092 -1.434017
H  -1.190699 2.385542 1.032689
H  -2.179632 3.544528 0.173536
H  -0.721184 3.154277 -1.873015
H  -4.458929 -2.227539 0.174421
H  -3.668191 -1.482229 1.558331
H  -5.71765 0.038081 1.795498
H  -6.293135 0.923819 0.386077
H  -6.405179 -0.83349 0.427269
H  0.630607 4.24103 0.644848
H  -0.449028 5.142206 -0.416305
H  1.118756 4.601826 -1.008481
H  0.296802 0.962245 -1.258176
H  1.544432 2.174825 -1.486471
H  1.067803 1.705658 0.142269
H  -2.463354 -1.781333 -1.256406
H  -1.280416 -1.643873 1.560836
H  -0.623072 -2.906165 -1.893604
H  1.049815 -2.369329 -1.994421
H  -0.262308 -1.215904 -2.188118
H  0.944366 -1.467135 1.681772
H  5.067985 -1.95333 0.256412
H  5.198638 -1.37505 1.913701
H  5.447697 2.234074 -0.246743
elementType: O C H
totalener: -853.24393970 hartree
nucrepener: 1553.31569229 hartree
electener: -2406.55963199 hartree
oneelecener: -4241.43201542 hartree
twoeener: 1834.87238342 hartree
cpcmener: -0.02280951 hartree
kineticenergy: 849.15015319 hartree
xcener: -85.608397820451 hartree
chargesum: -0.0000000
charge: -0.280253 -0.469094 0.081272 -0.184685 -0.103279 -0.159365 0.093630 -0.128910 -0.307579 -0.295460 -0.306427 -0.092596 -0.169210 0.014835 -0.268531 -0.200414 0.484273 0.032160 -0.410246 0.023920 0.043573 0.079382 0.068079 0.035740 0.070349 0.063878 0.073453 0.024517 0.090702 0.079793 0.087416 0.089405 0.088751 0.081216 0.086634 0.089006 0.073249 0.094926 0.081704 0.129815 0.111569 0.112385 0.109688 0.113544 0.115826 0.136880 0.135212 0.279266
qa: -0.2803 -0.4691 0.0813 -0.1847 -0.1033 -0.1594 0.0936 -0.1289 -0.3076 -0.2955 -0.3064 -0.0926 -0.1692 0.0148 -0.2685 -0.2004 0.4843 0.0322 -0.4102 0.0239 0.0436 0.0794 0.0681 0.0357 0.0703 0.0639 0.0735 0.0245 0.0907 0.0798 0.0874 0.0894 0.0888 0.0812 0.0866 0.0890 0.0732 0.0949 0.0817 0.1298 0.1116 0.1124 0.1097 0.1135 0.1158 0.1369 0.1352 0.2793
va: 2.1244 2.0213 3.7488 3.9077 3.8561 3.8877 3.8236 3.9415 3.9392 3.9283 3.9557 3.8483 3.8924 3.6866 3.9198 3.7798 4.1253 3.9146 3.7053 3.6585 1.0215 1.0060 1.0095 1.0264 1.0171 1.0124 1.0102 1.0172 1.0077 1.0128 1.0000 1.0040 1.0046 1.0029 1.0055 1.0052 1.0004 1.0084 1.0001 1.0013 1.0231 0.9982 1.0255 0.9902 1.0325 0.9996 0.9893 0.9507
dispcorr: -0.022885988 hartree
energy: -853.266825685842
dipole: -27.62958 26.39024 -1.23934 15.58603 -15.70017 -0.11414 -2.91373 3.36335 0.44961
magnitude: 1.32331 au
magnitude: 3.36358 debye
