program: Orca
programVersion: 5.0.2
elementType: O O C C C C C C C C C C C C C C C C C C H H H H H H H H H H H H H H H H H H H H H H H H H H H H
charge: 0
multiplicity: 1
keywords: wb97x-d3
keywords: def2-TZVPP
keywords: def2/J RIJCOSX
keywords: DEFGRID2
keywords: scfconv7
keywords: smallprint printgap noloewdin
keywords: NOSOSCF
formula: C18H28O2
InChI: InChI=1/C18H28O2/c1-6-13-20-18(19)14-17(5)12-8-11-16(4)10-7-9-15(2)3/h1,8,12,14-16H,7,9-11,13H2,2-5H3
48 atoms
O  3.728438 -1.959942 1.407745
O  3.386584 -1.808918 -0.793503
C  -4.05467 -0.154662 0.045385
C  -3.230622 1.119406 0.240689
C  -3.694457 2.302553 -0.600328
C  -2.859225 3.566471 -0.403337
C  -1.356864 3.42989 -0.667711
C  -3.336821 -1.377245 0.643133
C  -5.451697 -0.032324 0.641666
C  -1.061105 2.867517 -2.053202
C  -0.668367 4.777222 -0.479518
C  -2.032123 -1.650696 -0.02212
C  -0.847202 -1.643798 0.597716
C  0.447009 -1.83773 -0.049373
C  0.457313 -2.084349 -1.524179
C  1.538187 -1.763467 0.744091
C  2.936786 -1.845812 0.328201
C  5.132117 -2.015876 1.179953
C  5.67635 -0.720757 0.792414
C  6.137175 0.345767 0.488052
H  -4.157426 -0.330015 -1.033306
H  -3.236757 1.392759 1.303272
H  -2.18729 0.904089 -0.005009
H  -3.687541 2.013611 -1.656563
H  -4.735443 2.545478 -0.368256
H  -3.000516 3.927405 0.621545
H  -3.257456 4.352846 -1.055171
H  -0.935199 2.740439 0.072288
H  -3.985686 -2.251645 0.519094
H  -3.195588 -1.236973 1.719335
H  -6.032795 -0.943026 0.483238
H  -5.403591 0.144503 1.719184
H  -6.015141 0.789877 0.198472
H  0.014507 2.821761 -2.236373
H  -1.500409 3.492225 -2.835813
H  -1.450061 1.85583 -2.183847
H  0.413587 4.694056 -0.60069
H  -1.025014 5.508757 -1.209445
H  -0.855497 5.188707 0.514787
H  -2.083577 -1.839111 -1.091151
H  -0.82106 -1.448267 1.666237
H  0.081489 -1.208457 -2.057421
H  -0.209153 -2.912239 -1.770196
H  1.440588 -2.316696 -1.914262
H  1.384123 -1.615368 1.806904
H  5.384769 -2.773621 0.434654
H  5.566988 -2.330776 2.128582
H  6.531629 1.294664 0.199356
elementType: O C H
totalener: -853.24642488 hartree
nucrepener: 1486.93162141 hartree
electener: -2340.17804630 hartree
oneelecener: -4108.39101809 hartree
twoeener: 1768.21297180 hartree
cpcmener: -0.02210694 hartree
kineticenergy: 849.14896212 hartree
xcener: -85.608598052443 hartree
chargesum: -0.0000000
charge: -0.279629 -0.466180 0.073128 -0.169630 -0.127283 -0.198360 0.078412 -0.108244 -0.311068 -0.306327 -0.299015 -0.128511 -0.155821 0.023854 -0.259465 -0.182859 0.468659 0.030109 -0.418370 0.033139 0.041197 0.075128 0.067564 0.069348 0.081156 0.075157 0.075601 0.032192 0.095272 0.078967 0.090754 0.083712 0.091473 0.092519 0.087948 0.082162 0.090088 0.080815 0.088335 0.122353 0.112200 0.108666 0.103497 0.106555 0.117354 0.137031 0.135062 0.281355
qa: -0.2796 -0.4662 0.0731 -0.1696 -0.1273 -0.1984 0.0784 -0.1082 -0.3111 -0.3063 -0.2990 -0.1285 -0.1558 0.0239 -0.2595 -0.1829 0.4687 0.0301 -0.4184 0.0331 0.0412 0.0751 0.0676 0.0693 0.0812 0.0752 0.0756 0.0322 0.0953 0.0790 0.0908 0.0837 0.0915 0.0925 0.0879 0.0822 0.0901 0.0808 0.0883 0.1224 0.1122 0.1087 0.1035 0.1066 0.1174 0.1370 0.1351 0.2814
va: 2.1247 2.0370 3.7814 3.8779 3.8781 3.9135 3.7738 3.9098 3.9469 3.9366 3.9311 3.8769 3.8993 3.7187 3.9300 3.7854 4.1600 3.9139 3.7174 3.6448 1.0225 1.0142 1.0058 1.0029 1.0139 1.0085 1.0103 1.0143 1.0062 1.0154 1.0043 1.0018 1.0036 1.0054 1.0030 1.0007 1.0044 1.0042 1.0041 1.0053 1.0231 0.9957 0.9962 1.0302 1.0307 0.9995 0.9893 0.9487
dispcorr: -0.019850653 hartree
energy: -853.266275536994
dipole: -34.69041 33.45190 -1.23851 20.84865 -21.00750 -0.15885 -6.39811 6.93023 0.53211
magnitude: 1.35731 au
magnitude: 3.45001 debye
