program: Orca
programVersion: 5.0.2
elementType: O O C C C C C C C C C C C C C C C C C C H H H H H H H H H H H H H H H H H H H H H H H H H H H H
charge: 0
multiplicity: 1
keywords: wb97x-d3
keywords: def2-TZVPP
keywords: def2/J RIJCOSX
keywords: DEFGRID2
keywords: scfconv7
keywords: smallprint printgap noloewdin
keywords: NOSOSCF
formula: C18H28O2
InChI: InChI=1/C18H28O2/c1-6-13-20-18(19)14-17(5)12-8-11-16(4)10-7-9-15(2)3/h1,8,12,14-16H,7,9-11,13H2,2-5H3
48 atoms
O  4.068955 -0.711261 0.609388
O  3.508859 -2.530467 -0.560231
C  -4.076064 -0.504479 -0.007316
C  -3.524117 0.554548 -0.967151
C  -3.063027 1.857333 -0.322425
C  -2.523214 2.845241 -1.350523
C  -2.019009 4.16986 -0.773164
C  -3.032554 -0.98217 1.012622
C  -5.336431 -0.040294 0.714103
C  -1.333467 4.993957 -1.857392
C  -3.136787 4.977686 -0.122291
C  -1.807448 -1.544557 0.378749
C  -0.563776 -1.121896 0.631166
C  0.653415 -1.683199 0.051878
C  0.501346 -2.778592 -0.953715
C  1.823858 -1.15536 0.473262
C  3.173202 -1.571178 0.094787
C  5.447125 -0.986303 0.389894
C  5.929197 -2.054875 1.255399
C  6.343055 -2.907953 1.99218
H  -4.349011 -1.371916 -0.620148
H  -2.691213 0.122632 -1.532956
H  -4.297726 0.781531 -1.708881
H  -3.894145 2.3084 0.226299
H  -2.282279 1.655271 0.41861
H  -3.298247 3.05601 -2.097878
H  -1.702887 2.365652 -1.896571
H  -1.272853 3.93902 -0.002746
H  -3.494785 -1.765538 1.624908
H  -2.766998 -0.173162 1.698679
H  -5.135631 0.782138 1.403385
H  -6.095632 0.300672 0.007215
H  -5.775059 -0.851611 1.29862
H  -2.031384 5.249478 -2.659107
H  -0.500693 4.450288 -2.308449
H  -0.936015 5.929933 -1.459306
H  -3.923033 5.211288 -0.845461
H  -3.60294 4.448828 0.710316
H  -2.761928 5.925221 0.27033
H  -1.97108 -2.356469 -0.325039
H  -0.425344 -0.309892 1.339996
H  0.015618 -3.645628 -0.501503
H  1.442282 -3.105438 -1.37918
H  -0.143832 -2.447509 -1.769608
H  1.781495 -0.337812 1.183788
H  5.969678 -0.05897 0.6258
H  5.648629 -1.2207 -0.65769
H  6.701695 -3.674236 2.642683
elementType: O C H
totalener: -853.24724334 hartree
nucrepener: 1460.75189542 hartree
electener: -2313.99913877 hartree
oneelecener: -4055.91889975 hartree
twoeener: 1741.91976098 hartree
cpcmener: -0.02197832 hartree
kineticenergy: 849.14702048 hartree
xcener: -85.608004153341 hartree
chargesum: 0.0000000
charge: -0.278619 -0.466538 0.092017 -0.166743 -0.155079 -0.162186 0.078417 -0.158393 -0.333493 -0.295135 -0.302476 -0.116676 -0.147995 0.015064 -0.259923 -0.183084 0.467231 0.030017 -0.418655 0.034934 0.054907 0.079608 0.085363 0.080577 0.064833 0.066137 0.070421 0.025039 0.100024 0.084713 0.082252 0.095283 0.096035 0.080307 0.087163 0.088735 0.082047 0.087911 0.090622 0.126738 0.111821 0.107041 0.106548 0.104169 0.116470 0.135073 0.136382 0.281095
qa: -0.2786 -0.4665 0.0920 -0.1667 -0.1551 -0.1622 0.0784 -0.1584 -0.3335 -0.2951 -0.3025 -0.1167 -0.1480 0.0151 -0.2599 -0.1831 0.4672 0.0300 -0.4187 0.0349 0.0549 0.0796 0.0854 0.0806 0.0648 0.0661 0.0704 0.0250 0.1000 0.0847 0.0823 0.0953 0.0960 0.0803 0.0872 0.0887 0.0820 0.0879 0.0906 0.1267 0.1118 0.1070 0.1065 0.1042 0.1165 0.1351 0.1364 0.2811
va: 2.1243 2.0388 3.7770 3.8928 3.8691 3.8861 3.8135 3.9264 3.9521 3.9300 3.9275 3.8584 3.9005 3.7230 3.9246 3.7681 4.1729 3.9118 3.7256 3.6417 1.0136 1.0082 1.0083 1.0014 1.0082 1.0122 1.0126 1.0183 1.0048 1.0041 0.9972 1.0028 1.0042 1.0033 1.0051 1.0052 1.0030 1.0031 1.0047 1.0020 1.0225 0.9959 1.0330 0.9965 1.0320 0.9891 1.0012 0.9488
dispcorr: -0.019258589 hartree
energy: -853.266501933569
dipole: -39.14514 37.95976 -1.18538 23.75518 -23.13940 0.61578 -6.12355 6.40958 0.28603
magnitude: 1.36606 au
magnitude: 3.47224 debye
