program: Orca
programVersion: 5.0.2
elementType: O O C C C C C C C C C C C C C C C C C C H H H H H H H H H H H H H H H H H H H H H H H H H H H H
charge: 0
multiplicity: 1
keywords: wb97x-d3
keywords: def2-TZVPP
keywords: def2/J RIJCOSX
keywords: DEFGRID2
keywords: scfconv7
keywords: smallprint printgap noloewdin
keywords: NOSOSCF
formula: C18H28O2
InChI: InChI=1/C18H28O2/c1-6-13-20-18(19)14-17(5)12-8-11-16(4)10-7-9-15(2)3/h1,8,12,14-16H,7,9-11,13H2,2-5H3
48 atoms
O  4.211851 -3.497955 0.316573
O  4.905439 -1.376117 0.355518
C  -2.585745 0.982295 0.059163
C  -4.033157 1.056844 0.55071
C  -5.035309 1.67711 -0.418764
C  -4.713662 3.118236 -0.796266
C  -5.813195 3.82847 -1.587743
C  -1.714634 0.362929 1.16244
C  -2.460704 0.201302 -1.242277
C  -5.469092 5.302286 -1.769386
C  -6.063068 3.167137 -2.938844
C  -0.25842 0.381326 0.85111
C  0.517709 -0.706952 0.810335
C  1.953883 -0.712324 0.548214
C  2.611854 0.598802 0.25984
C  2.572308 -1.913243 0.584662
C  3.998919 -2.174589 0.406615
C  5.558827 -3.930887 0.165806
C  6.320539 -3.797714 1.400945
C  6.953185 -3.710724 2.417987
H  -2.220804 2.001359 -0.11549
H  -4.366858 0.043514 0.802206
H  -4.054999 1.622163 1.489088
H  -5.115261 1.056413 -1.315127
H  -6.02494 1.64631 0.049638
H  -3.784042 3.15853 -1.375994
H  -4.519697 3.685145 0.1219
H  -6.740182 3.767667 -1.00413
H  -2.045311 -0.660814 1.363751
H  -1.875414 0.932854 2.0852
H  -2.835388 -0.819505 -1.12634
H  -3.02246 0.667584 -2.052964
H  -1.422961 0.132704 -1.573471
H  -5.324851 5.801589 -0.808909
H  -6.258814 5.837062 -2.300975
H  -4.547181 5.424079 -2.344145
H  -6.822944 3.705979 -3.508811
H  -5.151318 3.150124 -3.542592
H  -6.409227 2.137349 -2.83879
H  0.169638 1.361382 0.658143
H  0.064609 -1.674836 1.006983
H  2.567465 1.246292 1.138066
H  2.080695 1.117615 -0.539564
H  3.650264 0.503575 -0.032752
H  1.965246 -2.791944 0.770902
H  6.058851 -3.400455 -0.647907
H  5.495616 -4.981582 -0.117457
H  7.518723 -3.635786 3.319735
elementType: O C H
totalener: -853.24742008 hartree
nucrepener: 1411.04027698 hartree
electener: -2264.28769706 hartree
oneelecener: -3956.45860285 hartree
twoeener: 1692.17090579 hartree
cpcmener: -0.02222929 hartree
kineticenergy: 849.15613835 hartree
xcener: -85.609347973363 hartree
chargesum: -0.0000000
charge: -0.279235 -0.466376 0.099127 -0.202699 -0.140562 -0.154761 0.067524 -0.114941 -0.335006 -0.291096 -0.302531 -0.151938 -0.130745 0.013625 -0.263030 -0.180179 0.467177 0.030606 -0.418134 0.032939 0.050028 0.081068 0.076223 0.070720 0.078382 0.063840 0.073391 0.025606 0.079358 0.095090 0.087302 0.094475 0.098031 0.087250 0.089166 0.080085 0.090860 0.081722 0.090472 0.125955 0.111589 0.110561 0.101647 0.106964 0.117605 0.136503 0.135345 0.280998
qa: -0.2792 -0.4664 0.0991 -0.2027 -0.1406 -0.1548 0.0675 -0.1149 -0.3350 -0.2911 -0.3025 -0.1519 -0.1307 0.0136 -0.2630 -0.1802 0.4672 0.0306 -0.4181 0.0329 0.0500 0.0811 0.0762 0.0707 0.0784 0.0638 0.0734 0.0256 0.0794 0.0951 0.0873 0.0945 0.0980 0.0873 0.0892 0.0801 0.0909 0.0817 0.0905 0.1260 0.1116 0.1106 0.1016 0.1070 0.1176 0.1365 0.1353 0.2810
va: 2.1246 2.0371 3.7186 3.9291 3.8831 3.8576 3.8270 3.9148 3.9567 3.9294 3.9281 3.8967 3.9092 3.7245 3.9299 3.7808 4.1646 3.9151 3.7135 3.6458 1.0203 1.0099 1.0091 1.0023 1.0116 1.0120 1.0115 1.0191 1.0181 1.0056 1.0027 1.0006 1.0036 1.0052 1.0054 1.0034 1.0052 1.0035 1.0022 1.0046 1.0236 0.9954 0.9961 1.0310 1.0308 0.9997 0.9891 0.9489
dispcorr: -0.018851359 hartree
energy: -853.266271441259
dipole: -49.60661 48.15662 -1.44999 29.22372 -29.13201 0.09171 -12.02167 11.94885 -0.07282
magnitude: 1.45471 au
magnitude: 3.69758 debye
