program: Orca
programVersion: 5.0.2
elementType: O O C C C C C C C C C C C C C C C C C C H H H H H H H H H H H H H H H H H H H H H H H H H H H H
charge: 0
multiplicity: 1
keywords: wb97x-d3
keywords: def2-TZVPP
keywords: def2/J RIJCOSX
keywords: DEFGRID2
keywords: scfconv7
keywords: smallprint printgap noloewdin
keywords: NOSOSCF
formula: C18H28O2
InChI: InChI=1/C18H28O2/c1-6-13-20-18(19)14-17(5)12-8-11-16(4)10-7-9-15(2)3/h1,8,12,14-16H,7,9-11,13H2,2-5H3
48 atoms
O  3.691823 -1.49995 1.296193
O  3.265042 -2.460441 -0.673754
C  -4.136672 -0.356061 -0.493061
C  -3.271447 0.747712 -1.110348
C  -2.782199 1.823885 -0.147173
C  -1.86325 2.831193 -0.828931
C  -1.291198 3.907729 0.095823
C  -3.390005 -1.174049 0.574885
C  -5.442902 0.181255 0.07995
C  -0.228707 4.725436 -0.630128
C  -2.374267 4.82513 0.653791
C  -2.118355 -1.761121 0.068127
C  -0.910532 -1.503583 0.582061
C  0.35457 -2.023112 0.070719
C  0.299446 -2.971476 -1.08357
C  1.479225 -1.601687 0.690337
C  2.859045 -1.922041 0.329917
C  5.086079 -1.691337 1.086398
C  5.62367 -0.756859 0.105886
C  6.07996 0.026086 -0.681343
H  -4.392489 -1.045588 -1.306283
H  -2.405559 0.288701 -1.599562
H  -3.844961 1.223873 -1.912988
H  -3.639763 2.339731 0.293127
H  -2.240382 1.365502 0.687197
H  -2.397378 3.317041 -1.654981
H  -1.031321 2.285003 -1.287812
H  -0.805647 3.401691 0.939569
H  -4.049759 -1.987381 0.898174
H  -3.197423 -0.562248 1.460331
H  -5.275603 0.819546 0.949807
H  -5.987998 0.770026 -0.660733
H  -6.098427 -0.631998 0.39796
H  -0.653731 5.252483 -1.488461
H  0.580579 4.093071 -1.001236
H  0.217123 5.475723 0.026231
H  -2.91171 5.331513 -0.152561
H  -3.110281 4.285921 1.251893
H  -1.944678 5.597246 1.29544
H  -2.213363 -2.420462 -0.790557
H  -0.841512 -0.833424 1.434849
H  1.265197 -3.386404 -1.345214
H  -0.102522 -2.47093 -1.967067
H  -0.375487 -3.798056 -0.856349
H  1.370671 -0.944444 1.545681
H  5.308343 -2.720299 0.79476
H  5.551708 -1.516808 2.056616
H  6.482632 0.719219 -1.385943
elementType: O C H
totalener: -853.24697660 hartree
nucrepener: 1481.03596718 hartree
electener: -2334.28294379 hartree
oneelecener: -4096.59360421 hartree
twoeener: 1762.31066043 hartree
cpcmener: -0.02217648 hartree
kineticenergy: 849.14648308 hartree
xcener: -85.607951853430 hartree
chargesum: 0.0000000
charge: -0.279681 -0.466318 0.089545 -0.163266 -0.163571 -0.155912 0.074942 -0.154854 -0.334999 -0.295825 -0.302370 -0.113245 -0.155812 0.016915 -0.259590 -0.182655 0.466785 0.029185 -0.419065 0.035588 0.055063 0.078404 0.086735 0.083642 0.064504 0.066406 0.069878 0.024905 0.098873 0.082888 0.082296 0.095781 0.096324 0.080285 0.087994 0.089134 0.081472 0.088483 0.091248 0.127341 0.113018 0.105738 0.108812 0.103976 0.117677 0.137011 0.135159 0.281156
qa: -0.2797 -0.4663 0.0895 -0.1633 -0.1636 -0.1559 0.0749 -0.1549 -0.3350 -0.2958 -0.3024 -0.1132 -0.1558 0.0169 -0.2596 -0.1827 0.4668 0.0292 -0.4191 0.0356 0.0551 0.0784 0.0867 0.0836 0.0645 0.0664 0.0699 0.0249 0.0989 0.0829 0.0823 0.0958 0.0963 0.0803 0.0880 0.0891 0.0815 0.0885 0.0912 0.1273 0.1130 0.1057 0.1088 0.1040 0.1177 0.1370 0.1352 0.2812
va: 2.1242 2.0371 3.7785 3.8874 3.8720 3.8792 3.8159 3.9296 3.9533 3.9307 3.9275 3.8506 3.9027 3.7279 3.9272 3.7808 4.1638 3.9127 3.7212 3.6442 1.0135 1.0081 1.0081 1.0012 1.0075 1.0127 1.0129 1.0180 1.0063 1.0048 0.9967 1.0024 1.0042 1.0032 1.0050 1.0051 1.0031 1.0029 1.0044 1.0017 1.0213 1.0305 0.9961 0.9963 1.0311 0.9999 0.9892 0.9489
dispcorr: -0.019601182 hartree
energy: -853.266577783844
dipole: -34.54699 33.32231 -1.22467 22.61431 -22.46898 0.14533 -3.05601 3.64180 0.58579
magnitude: 1.36532 au
magnitude: 3.47036 debye
