program: Orca
programVersion: 5.0.2
elementType: O O C C C C C C C C C C C C C C C C C C H H H H H H H H H H H H H H H H H H H H H H H H H H H H
charge: 0
multiplicity: 1
keywords: wb97x-d3
keywords: def2-TZVPP
keywords: def2/J RIJCOSX
keywords: DEFGRID2
keywords: scfconv7
keywords: smallprint printgap noloewdin
keywords: NOSOSCF
formula: C18H28O2
InChI: InChI=1/C18H28O2/c1-6-13-20-18(19)14-17(5)12-8-11-16(4)10-7-9-15(2)3/h1,8,12,14-16H,7,9-11,13H2,2-5H3
48 atoms
O  3.740081 -1.609257 1.320558
O  3.309804 -2.440535 -0.706459
C  -4.135551 -0.367052 -0.438203
C  -3.318753 0.750373 -1.095425
C  -2.824312 1.849222 -0.161101
C  -1.986745 2.891421 -0.894579
C  -1.407929 3.994595 -0.006208
C  -3.33587 -1.151156 0.615197
C  -5.438275 0.142959 0.167173
C  -0.42677 4.854378 -0.795256
C  -2.495093 4.866974 0.612725
C  -2.069007 -1.721174 0.077914
C  -0.854924 -1.472442 0.581274
C  0.403164 -1.991283 0.052004
C  0.335075 -2.905999 -1.128694
C  1.533506 -1.606673 0.684883
C  2.907899 -1.948146 0.321758
C  5.130075 -1.837148 1.118928
C  5.715893 -0.867654 0.202165
C  6.215351 -0.055953 -0.528419
H  -4.397642 -1.073565 -1.234697
H  -2.45774 0.307377 -1.607735
H  -3.92965 1.202744 -1.884036
H  -3.677529 2.330731 0.324126
H  -2.220538 1.415799 0.643485
H  -2.586782 3.351693 -1.689329
H  -1.160509 2.37924 -1.400627
H  -0.852032 3.513797 0.808295
H  -3.96646 -1.974308 0.970921
H  -3.128817 -0.523467 1.486222
H  -6.061817 -0.683515 0.514142
H  -5.26301 0.796232 1.024263
H  -6.020817 0.70757 -0.56367
H  0.383687 4.25532 -1.215817
H  0.027224 5.623279 -0.166616
H  -0.92458 5.362737 -1.625336
H  -3.171085 4.299776 1.254188
H  -2.062412 5.660083 1.226106
H  -3.100261 5.345957 -0.161894
H  -2.174738 -2.367022 -0.789797
H  -0.775023 -0.817338 1.444757
H  1.29677 -3.318493 -1.408863
H  -0.070323 -2.37832 -1.994672
H  -0.342602 -3.735576 -0.920728
H  1.434559 -0.975078 1.560545
H  5.321215 -2.854682 0.770688
H  5.586231 -1.735856 2.103953
H  6.653287 0.663831 -1.183064
elementType: O C H
totalener: -853.24700962 hartree
nucrepener: 1475.07899760 hartree
electener: -2328.32600723 hartree
oneelecener: -4084.67246405 hartree
twoeener: 1756.34645682 hartree
cpcmener: -0.02218446 hartree
kineticenergy: 849.14376221 hartree
xcener: -85.607219956638 hartree
chargesum: 0.0000000
charge: -0.279808 -0.465462 0.088840 -0.163260 -0.161058 -0.156563 0.075615 -0.155187 -0.334365 -0.296072 -0.302929 -0.114577 -0.153358 0.014807 -0.259183 -0.180696 0.464653 0.029142 -0.418756 0.035418 0.054332 0.079191 0.086535 0.081990 0.065155 0.066608 0.069423 0.025339 0.099415 0.082930 0.096385 0.082157 0.095650 0.088071 0.089297 0.079756 0.088071 0.091209 0.081868 0.127023 0.112727 0.105389 0.108794 0.103708 0.118256 0.137249 0.134854 0.281413
qa: -0.2798 -0.4655 0.0888 -0.1633 -0.1611 -0.1566 0.0756 -0.1552 -0.3344 -0.2961 -0.3029 -0.1146 -0.1534 0.0148 -0.2592 -0.1807 0.4647 0.0291 -0.4188 0.0354 0.0543 0.0792 0.0865 0.0820 0.0652 0.0666 0.0694 0.0253 0.0994 0.0829 0.0964 0.0822 0.0956 0.0881 0.0893 0.0798 0.0881 0.0912 0.0819 0.1270 0.1127 0.1054 0.1088 0.1037 0.1183 0.1372 0.1349 0.2814
va: 2.1244 2.0373 3.7814 3.8881 3.8717 3.8806 3.8162 3.9278 3.9531 3.9307 3.9280 3.8533 3.9004 3.7367 3.9281 3.7846 4.1624 3.9130 3.7221 3.6431 1.0135 1.0080 1.0080 1.0013 1.0075 1.0125 1.0129 1.0181 1.0058 1.0046 1.0042 0.9969 1.0025 1.0050 1.0051 1.0033 1.0029 1.0044 1.0030 1.0019 1.0216 1.0303 0.9963 0.9960 1.0307 0.9998 0.9893 0.9488
dispcorr: -0.019468546 hartree
energy: -853.266478169578
dipole: -35.41502 34.19139 -1.22362 23.06106 -22.96058 0.10048 -3.35340 3.96813 0.61473
magnitude: 1.37304 au
magnitude: 3.48999 debye
