program: Orca
programVersion: 5.0.2
elementType: O O C C C C C C C C C C C C C C C C C C H H H H H H H H H H H H H H H H H H H H H H H H H H H H
charge: 0
multiplicity: 1
keywords: wb97x-d3
keywords: def2-TZVPP
keywords: def2/J RIJCOSX
keywords: DEFGRID2
keywords: scfconv7
keywords: smallprint printgap noloewdin
keywords: NOSOSCF
formula: C18H28O2
InChI: InChI=1/C18H28O2/c1-6-13-20-18(19)14-17(5)12-8-11-16(4)10-7-9-15(2)3/h1,8,12,14-16H,7,9-11,13H2,2-5H3
48 atoms
O  3.728658 -1.584919 1.304045
O  3.293563 -2.45599 -0.705317
C  -4.138365 -0.363605 -0.446616
C  -3.309895 0.749818 -1.096139
C  -2.8125 1.842107 -0.155556
C  -1.95391 2.874482 -0.87834
C  -1.365682 3.965473 0.018882
C  -3.350664 -1.155444 0.610562
C  -5.441107 0.154232 0.15196
C  -0.372046 4.818756 -0.761652
C  -2.444549 4.846275 0.640294
C  -2.083925 -1.730963 0.078859
C  -0.869861 -1.478843 0.580613
C  0.388197 -2.000964 0.054414
C  0.319971 -2.925636 -1.118366
C  1.5192 -1.606504 0.679954
C  2.893757 -1.946059 0.31543
C  5.119241 -1.805615 1.099216
C  5.693568 -0.835572 0.175749
C  6.185569 -0.023202 -0.558892
H  -4.40025 -1.066566 -1.246319
H  -2.449546 0.301918 -1.605231
H  -3.913243 1.209184 -1.886539
H  -3.66516 2.333856 0.320287
H  -2.223058 1.400947 0.655436
H  -2.540548 3.346584 -1.676184
H  -1.131143 2.351855 -1.379342
H  -0.81789 3.472993 0.831908
H  -3.988566 -1.975233 0.960781
H  -3.144994 -0.530473 1.483858
H  -6.014807 0.724772 -0.581307
H  -6.072906 -0.668491 0.492875
H  -5.266386 0.804213 1.011637
H  0.089749 5.577618 -0.126508
H  -0.861765 5.338982 -1.58918
H  0.432047 4.212863 -1.184624
H  -3.043278 5.335559 -0.132888
H  -3.127661 4.283182 1.277861
H  -2.004314 5.631527 1.258377
H  -2.189681 -2.38331 -0.783923
H  -0.789836 -0.818353 1.439994
H  -0.084616 -2.404841 -1.988906
H  -0.35842 -3.752849 -0.903878
H  1.281562 -3.340947 -1.394666
H  1.420703 -0.965221 1.5486
H  5.316283 -2.823728 0.756132
H  5.578246 -1.695121 2.081937
H  6.618005 0.69643 -1.217702
elementType: O C H
totalener: -853.24702268 hartree
nucrepener: 1476.63996353 hartree
electener: -2329.88698621 hartree
oneelecener: -4087.79338434 hartree
twoeener: 1757.90639813 hartree
cpcmener: -0.02214265 hartree
kineticenergy: 849.14348988 hartree
xcener: -85.607203916611 hartree
chargesum: -0.0000000
charge: -0.279584 -0.466130 0.088986 -0.163262 -0.161818 -0.156640 0.075678 -0.154977 -0.334541 -0.296265 -0.303204 -0.114547 -0.153591 0.015366 -0.259691 -0.181008 0.465002 0.029191 -0.419416 0.036312 0.054604 0.079029 0.086648 0.082482 0.065016 0.066696 0.069472 0.025417 0.099313 0.082942 0.095590 0.096377 0.082223 0.089320 0.079787 0.088125 0.081932 0.088236 0.091258 0.127089 0.112822 0.108925 0.103706 0.105640 0.118113 0.137193 0.134867 0.281314
qa: -0.2796 -0.4661 0.0890 -0.1633 -0.1618 -0.1566 0.0757 -0.1550 -0.3345 -0.2963 -0.3032 -0.1145 -0.1536 0.0154 -0.2597 -0.1810 0.4650 0.0292 -0.4194 0.0363 0.0546 0.0790 0.0866 0.0825 0.0650 0.0667 0.0695 0.0254 0.0993 0.0829 0.0956 0.0964 0.0822 0.0893 0.0798 0.0881 0.0819 0.0882 0.0913 0.1271 0.1128 0.1089 0.1037 0.1056 0.1181 0.1372 0.1349 0.2813
va: 2.1244 2.0370 3.7803 3.8881 3.8716 3.8797 3.8154 3.9282 3.9531 3.9309 3.9281 3.8525 3.9003 3.7341 3.9278 3.7836 4.1632 3.9130 3.7241 3.6418 1.0135 1.0080 1.0080 1.0011 1.0075 1.0125 1.0130 1.0181 1.0059 1.0047 1.0025 1.0042 0.9969 1.0051 1.0033 1.0049 1.0030 1.0028 1.0044 1.0019 1.0216 0.9962 0.9961 1.0304 1.0308 1.0002 0.9893 0.9488
dispcorr: -0.019503488 hartree
energy: -853.266526167052
dipole: -35.16256 33.94257 -1.21999 22.94785 -22.83140 0.11645 -3.21911 3.82921 0.61010
magnitude: 1.36900 au
magnitude: 3.47972 debye
