program: Orca
programVersion: 5.0.2
elementType: O O C C C C C C C C C C C C C C C C C C H H H H H H H H H H H H H H H H H H H H H H H H H H H H
charge: 0
multiplicity: 1
keywords: wb97x-d3
keywords: def2-TZVPP
keywords: def2/J RIJCOSX
keywords: DEFGRID2
keywords: scfconv7
keywords: smallprint printgap noloewdin
keywords: NOSOSCF
formula: C18H28O2
InChI: InChI=1/C18H28O2/c1-6-13-20-18(19)14-17(5)12-8-11-16(4)10-7-9-15(2)3/h1,8,12,14-16H,7,9-11,13H2,2-5H3
48 atoms
O  4.007195 -0.644059 0.594207
O  3.473811 -2.523844 -0.487488
C  -4.113219 -0.511591 -0.024331
C  -3.5303 0.537178 -0.97744
C  -3.027134 1.819839 -0.323769
C  -2.457332 2.799464 -1.344106
C  -1.877648 4.084114 -0.748662
C  -3.09063 -1.01035 1.00756
C  -5.370418 -0.0211 0.685358
C  -1.150084 4.887346 -1.821211
C  -2.945997 4.940914 -0.077279
C  -1.857413 -1.573472 0.390486
C  -0.619082 -1.139777 0.650565
C  0.608222 -1.694603 0.087221
C  0.477175 -2.812405 -0.896475
C  1.769553 -1.141375 0.501103
C  3.124291 -1.543407 0.127807
C  5.386413 -0.892879 0.349559
C  5.909898 -1.957132 1.196065
C  6.355781 -2.814281 1.908856
H  -4.397772 -1.372734 -0.640632
H  -2.710887 0.084487 -1.546529
H  -4.297006 0.79255 -1.71701
H  -3.840527 2.292995 0.23293
H  -2.250149 1.586118 0.411676
H  -3.232956 3.063747 -2.073352
H  -1.670832 2.290424 -1.912805
H  -1.14233 3.798469 0.013818
H  -3.569925 -1.796901 1.602109
H  -2.831956 -0.210789 1.707067
H  -5.830715 -0.822229 1.267278
H  -5.158061 0.798013 1.375074
H  -6.116142 0.334471 -0.028554
H  -1.834368 5.197995 -2.615103
H  -0.351613 4.304569 -2.285177
H  -0.6975 5.791152 -1.407964
H  -3.716928 5.23817 -0.793442
H  -3.442661 4.420319 0.742914
H  -2.515938 5.854923 0.337612
H  -2.010087 -2.392355 -0.307605
H  -0.4937 -0.320089 1.352994
H  -0.198478 -2.523645 -1.703317
H  0.037957 -3.689622 -0.416766
H  1.420935 -3.109644 -1.337123
H  1.714776 -0.308695 1.193066
H  5.894775 0.043855 0.579106
H  5.570937 -1.118124 -0.703305
H  6.746462 -3.580294 2.541014
elementType: O C H
totalener: -853.24722782 hartree
nucrepener: 1465.55965479 hartree
electener: -2318.80688262 hartree
oneelecener: -4065.54418582 hartree
twoeener: 1746.73730320 hartree
cpcmener: -0.02216243 hartree
kineticenergy: 849.14801345 hartree
xcener: -85.608318283395 hartree
chargesum: -0.0000000
charge: -0.279086 -0.466034 0.088789 -0.163921 -0.159140 -0.158961 0.075962 -0.155202 -0.332032 -0.295119 -0.301415 -0.116073 -0.149361 0.013453 -0.260111 -0.181329 0.466463 0.029113 -0.418227 0.034202 0.055450 0.079528 0.085095 0.081964 0.063812 0.066499 0.070199 0.024884 0.099929 0.083921 0.095822 0.081939 0.094773 0.080279 0.087470 0.088970 0.081561 0.088039 0.090639 0.127024 0.112103 0.102317 0.109173 0.106396 0.116952 0.135191 0.136832 0.281265
qa: -0.2791 -0.4660 0.0888 -0.1639 -0.1591 -0.1590 0.0760 -0.1552 -0.3320 -0.2951 -0.3014 -0.1161 -0.1494 0.0135 -0.2601 -0.1813 0.4665 0.0291 -0.4182 0.0342 0.0554 0.0795 0.0851 0.0820 0.0638 0.0665 0.0702 0.0249 0.0999 0.0839 0.0958 0.0819 0.0948 0.0803 0.0875 0.0890 0.0816 0.0880 0.0906 0.1270 0.1121 0.1023 0.1092 0.1064 0.1170 0.1352 0.1368 0.2813
va: 2.1244 2.0384 3.7798 3.8909 3.8705 3.8839 3.8156 3.9242 3.9520 3.9297 3.9271 3.8564 3.8984 3.7305 3.9270 3.7753 4.1684 3.9132 3.7176 3.6435 1.0132 1.0080 1.0084 1.0016 1.0079 1.0125 1.0126 1.0182 1.0049 1.0043 1.0040 0.9975 1.0031 1.0033 1.0050 1.0051 1.0032 1.0030 1.0048 1.0019 1.0221 0.9967 0.9956 1.0315 1.0316 0.9892 0.9998 0.9488
dispcorr: -0.019365881 hartree
energy: -853.266593704705
dipole: -38.42389 37.22854 -1.19534 23.29910 -22.67614 0.62296 -6.11569 6.34852 0.23283
magnitude: 1.36789 au
magnitude: 3.47691 debye
