program: Orca
programVersion: 5.0.2
elementType: O O C C C C C C C C C C C C C C C C C C H H H H H H H H H H H H H H H H H H H H H H H H H H H H
charge: 0
multiplicity: 1
keywords: wb97x-d3
keywords: def2-TZVPP
keywords: def2/J RIJCOSX
keywords: DEFGRID2
keywords: scfconv7
keywords: smallprint printgap noloewdin
keywords: NOSOSCF
formula: C18H28O2
InChI: InChI=1/C18H28O2/c1-6-13-20-18(19)14-17(5)12-8-11-16(4)10-7-9-15(2)3/h1,8,12,14-16H,7,9-11,13H2,2-5H3
48 atoms
O  3.971633 -0.618528 0.554408
O  3.452411 -2.523205 -0.491134
C  -4.13177 -0.513169 -0.027601
C  -3.531431 0.530704 -0.975143
C  -3.012655 1.80386 -0.315115
C  -2.41228 2.772499 -1.328361
C  -1.810311 4.042796 -0.724973
C  -3.118546 -1.031771 1.004256
C  -5.381529 -0.005498 0.68315
C  -1.050968 4.828988 -1.78799
C  -2.866714 4.923885 -0.066066
C  -1.885492 -1.596646 0.388329
C  -0.647939 -1.161434 0.649593
C  0.580998 -1.710221 0.084046
C  0.453878 -2.832523 -0.895094
C  1.739657 -1.145219 0.489504
C  3.096146 -1.53638 0.110368
C  5.352369 -0.855465 0.306034
C  5.898232 -1.875386 1.191975
C  6.357502 -2.696084 1.9384
H  -4.428838 -1.367115 -0.647937
H  -2.716225 0.068701 -1.542795
H  -4.291567 0.799157 -1.716875
H  -3.823499 2.291966 0.232456
H  -2.248869 1.556044 0.429484
H  -3.175058 3.054911 -2.064374
H  -1.631852 2.247299 -1.890746
H  -1.091113 3.73985 0.046195
H  -3.607291 -1.820429 1.588118
H  -2.857519 -0.241346 1.71322
H  -5.155466 0.806032 1.377501
H  -6.120205 0.367075 -0.029468
H  -5.856503 -0.801455 1.260406
H  -0.582592 5.722069 -1.36895
H  -1.717435 5.155584 -2.590676
H  -0.260359 4.227743 -2.241831
H  -3.62245 5.238279 -0.791136
H  -3.384764 4.414886 0.748248
H  -2.421272 5.82823 0.353828
H  -2.037426 -2.413942 -0.311803
H  -0.524943 -0.341452 1.352135
H  -0.205242 -2.540267 -1.714514
H  -0.003537 -3.702016 -0.418629
H  1.401285 -3.142773 -1.318739
H  1.68105 -0.309013 1.177038
H  5.848475 0.097544 0.491359
H  5.531438 -1.121901 -0.738044
H  6.762102 -3.427507 2.601772
elementType: O C H
totalener: -853.24722328 hartree
nucrepener: 1467.76980817 hartree
electener: -2321.01703145 hartree
oneelecener: -4069.95827947 hartree
twoeener: 1748.94124802 hartree
cpcmener: -0.02210248 hartree
kineticenergy: 849.14544509 hartree
xcener: -85.607847353161 hartree
chargesum: -0.0000000
charge: -0.278850 -0.466729 0.088749 -0.163452 -0.160719 -0.157428 0.075080 -0.155037 -0.332684 -0.295264 -0.301228 -0.114486 -0.151443 0.013385 -0.259358 -0.180572 0.466028 0.029194 -0.418428 0.035244 0.055916 0.079311 0.085328 0.082506 0.063688 0.066473 0.069851 0.025042 0.099727 0.083566 0.081968 0.094862 0.095925 0.089045 0.080338 0.087711 0.081358 0.088099 0.090591 0.127383 0.111989 0.103240 0.107970 0.106061 0.117246 0.135183 0.136547 0.281075
qa: -0.2788 -0.4667 0.0887 -0.1635 -0.1607 -0.1574 0.0751 -0.1550 -0.3327 -0.2953 -0.3012 -0.1145 -0.1514 0.0134 -0.2594 -0.1806 0.4660 0.0292 -0.4184 0.0352 0.0559 0.0793 0.0853 0.0825 0.0637 0.0665 0.0699 0.0250 0.0997 0.0836 0.0820 0.0949 0.0959 0.0890 0.0803 0.0877 0.0814 0.0881 0.0906 0.1274 0.1120 0.1032 0.1080 0.1061 0.1172 0.1352 0.1365 0.2811
va: 2.1246 2.0376 3.7798 3.8906 3.8714 3.8826 3.8162 3.9249 3.9523 3.9297 3.9272 3.8544 3.8998 3.7291 3.9263 3.7739 4.1685 3.9125 3.7213 3.6411 1.0130 1.0080 1.0084 1.0016 1.0078 1.0126 1.0127 1.0182 1.0052 1.0042 0.9974 1.0030 1.0040 1.0051 1.0033 1.0050 1.0032 1.0030 1.0048 1.0016 1.0221 0.9964 0.9960 1.0321 1.0315 0.9891 1.0005 0.9489
dispcorr: -0.019415599 hartree
energy: -853.266638880384
dipole: -38.05610 36.85505 -1.20105 23.05532 -22.43028 0.62504 -5.99029 6.20833 0.21804
magnitude: 1.37140 au
magnitude: 3.48581 debye
