program: Orca
programVersion: 5.0.2
elementType: O O C C C C C C C C C C C C C C C C C C H H H H H H H H H H H H H H H H H H H H H H H H H H H H
charge: 0
multiplicity: 1
keywords: wb97x-d3
keywords: def2-TZVPP
keywords: def2/J RIJCOSX
keywords: DEFGRID2
keywords: scfconv7
keywords: smallprint printgap noloewdin
keywords: NOSOSCF
formula: C18H28O2
InChI: InChI=1/C18H28O2/c1-6-13-20-18(19)14-17(5)12-8-11-16(4)10-7-9-15(2)3/h1,8,12,14-16H,7,9-11,13H2,2-5H3
48 atoms
O  3.987871 -2.734756 1.579156
O  3.915659 -1.994877 -0.52632
C  -3.476122 0.176913 0.111345
C  -2.618703 1.297231 0.703415
C  -3.028596 2.716747 0.318359
C  -2.926121 2.994248 -1.178254
C  -3.060105 4.467619 -1.565615
C  -2.871939 -1.200418 0.431017
C  -4.914639 0.239918 0.609532
C  -2.82118 4.646745 -3.060696
C  -4.415476 5.043336 -1.169677
C  -1.527808 -1.401954 -0.181056
C  -0.418742 -1.689946 0.508577
C  0.916591 -1.851154 -0.060141
C  1.061842 -1.728821 -1.543279
C  1.918246 -2.104668 0.810555
C  3.33934 -2.256694 0.503549
C  5.391858 -2.930324 1.459452
C  6.126476 -1.671707 1.466354
C  6.741807 -0.640804 1.491976
H  -3.488555 0.279533 -0.980111
H  -2.631691 1.20208 1.795548
H  -1.575917 1.151379 0.403062
H  -4.040317 2.927083 0.675429
H  -2.375121 3.414884 0.852469
H  -3.685807 2.420652 -1.721802
H  -1.957704 2.625737 -1.536499
H  -2.283459 5.027713 -1.030081
H  -3.549101 -1.970057 0.042857
H  -2.821237 -1.342918 1.515015
H  -4.958569 0.152567 1.698318
H  -5.402657 1.176548 0.336147
H  -5.515323 -0.569469 0.189804
H  -1.84272 4.264581 -3.3595
H  -2.86413 5.69856 -3.3509
H  -3.57471 4.114438 -3.647218
H  -4.51344 6.082102 -1.492256
H  -5.230957 4.478958 -1.630501
H  -4.573549 5.026499 -0.090331
H  -1.482367 -1.286666 -1.260843
H  -0.49226 -1.792193 1.587921
H  0.814873 -0.715716 -1.867902
H  0.361016 -2.398613 -2.044402
H  2.059362 -1.958773 -1.897852
H  1.66321 -2.209667 1.859003
H  5.63808 -3.508461 0.565759
H  5.675744 -3.528602 2.325445
H  7.286824 0.276274 1.511265
elementType: O C H
totalener: -853.24704652 hartree
nucrepener: 1442.17840769 hartree
electener: -2295.42545421 hartree
oneelecener: -4018.81443080 hartree
twoeener: 1723.38897660 hartree
cpcmener: -0.02221726 hartree
kineticenergy: 849.14495748 hartree
xcener: -85.606987096482 hartree
chargesum: 0.0000000
charge: -0.279706 -0.465286 0.069894 -0.186588 -0.150116 -0.148302 0.064651 -0.128330 -0.316660 -0.291697 -0.301117 -0.127460 -0.142966 0.019222 -0.261043 -0.178662 0.465409 0.029232 -0.417768 0.033407 0.048797 0.081534 0.080352 0.071798 0.077967 0.064618 0.071900 0.027130 0.095202 0.079641 0.085834 0.093195 0.092652 0.087231 0.089468 0.079354 0.090499 0.081848 0.089728 0.123305 0.111546 0.109416 0.103378 0.106329 0.117845 0.136711 0.135403 0.281205
qa: -0.2797 -0.4653 0.0699 -0.1866 -0.1501 -0.1483 0.0647 -0.1283 -0.3167 -0.2917 -0.3011 -0.1275 -0.1430 0.0192 -0.2610 -0.1787 0.4654 0.0292 -0.4178 0.0334 0.0488 0.0815 0.0804 0.0718 0.0780 0.0646 0.0719 0.0271 0.0952 0.0796 0.0858 0.0932 0.0927 0.0872 0.0895 0.0794 0.0905 0.0818 0.0897 0.1233 0.1115 0.1094 0.1034 0.1063 0.1178 0.1367 0.1354 0.2812
va: 2.1241 2.0379 3.7530 3.9113 3.8873 3.8569 3.8296 3.9149 3.9528 3.9300 3.9295 3.8741 3.9016 3.7241 3.9280 3.7825 4.1617 3.9154 3.7148 3.6437 1.0210 1.0128 1.0090 1.0018 1.0106 1.0112 1.0115 1.0188 1.0057 1.0159 1.0018 1.0004 1.0049 1.0051 1.0054 1.0038 1.0051 1.0031 1.0023 1.0056 1.0234 0.9960 0.9960 1.0302 1.0306 0.9995 0.9892 0.9489
dispcorr: -0.019091829 hartree
energy: -853.266138347227
dipole: -42.59656 41.32052 -1.27604 26.89527 -27.00312 -0.10785 -10.08105 10.47066 0.38961
magnitude: 1.33855 au
magnitude: 3.40233 debye
