program: Orca
programVersion: 5.0.2
elementType: O O C C C C C C C C C C C C C C C C C C H H H H H H H H H H H H H H H H H H H H H H H H H H H H
charge: 0
multiplicity: 1
keywords: wb97x-d3
keywords: def2-TZVPP
keywords: def2/J RIJCOSX
keywords: DEFGRID2
keywords: scfconv7
keywords: smallprint printgap noloewdin
keywords: NOSOSCF
formula: C18H28O2
InChI: InChI=1/C18H28O2/c1-6-13-20-18(19)14-17(5)12-8-11-16(4)10-7-9-15(2)3/h1,8,12,14-16H,7,9-11,13H2,2-5H3
48 atoms
O  3.908677 -0.484413 0.518568
O  3.38709 -2.399605 -0.505536
C  -4.217447 -0.533582 0.112547
C  -3.66551 0.458168 -0.91646
C  -3.107069 1.759606 -0.35051
C  -2.569818 2.67457 -1.444852
C  -2.052761 4.030807 -0.9609
C  -3.162791 -0.972583 1.140032
C  -5.451238 -0.001228 0.832221
C  -0.872979 3.890638 -0.005125
C  -1.670176 4.905464 -2.149971
C  -1.936813 -1.544928 0.51713
C  -0.701887 -1.069167 0.71187
C  0.520502 -1.625466 0.139734
C  0.386497 -2.798117 -0.777604
C  1.67956 -1.023335 0.487115
C  3.032631 -1.410623 0.093139
C  5.287533 -0.716877 0.256447
C  5.848267 -1.724517 1.147422
C  6.320328 -2.532515 1.899473
H  -4.521192 -1.428242 -0.443802
H  -2.880068 -0.035475 -1.499325
H  -4.461403 0.690417 -1.632419
H  -3.881792 2.29061 0.212578
H  -2.311199 1.535383 0.364733
H  -3.362602 2.844725 -2.182116
H  -1.76431 2.160263 -1.98365
H  -2.867845 4.530242 -0.422766
H  -3.616215 -1.73729 1.781253
H  -2.898705 -0.138412 1.795695
H  -5.218928 0.862554 1.458401
H  -6.222901 0.304353 0.122838
H  -5.887612 -0.762995 1.481504
H  -0.049621 3.345419 -0.475026
H  -1.13916 3.358547 0.909396
H  -0.489169 4.868165 0.29419
H  -0.855703 4.455456 -2.723752
H  -2.511623 5.047683 -2.831212
H  -1.33695 5.894761 -1.829829
H  -2.091626 -2.404368 -0.129757
H  -0.574806 -0.208363 1.362941
H  -0.299744 -2.559274 -1.592059
H  -0.042909 -3.648826 -0.244527
H  1.327357 -3.114199 -1.21117
H  1.624142 -0.158863 1.138872
H  5.780913 0.240527 0.425541
H  5.455633 -0.994181 -0.786594
H  6.737593 -3.256113 2.563495
elementType: O C H
totalener: -853.24716518 hartree
nucrepener: 1479.43134281 hartree
electener: -2332.67850799 hartree
oneelecener: -4093.30948156 hartree
twoeener: 1760.63097357 hartree
cpcmener: -0.02203646 hartree
kineticenergy: 849.15024034 hartree
xcener: -85.608929058023 hartree
chargesum: -0.0000000
charge: -0.278838 -0.466935 0.084227 -0.162579 -0.148105 -0.161218 0.080797 -0.150553 -0.329810 -0.305233 -0.296661 -0.114471 -0.154644 0.018425 -0.261018 -0.182323 0.467435 0.028880 -0.417974 0.034629 0.055483 0.079171 0.084662 0.076694 0.058432 0.068886 0.066629 0.025222 0.100518 0.082021 0.082955 0.093942 0.095216 0.082361 0.089590 0.091259 0.080666 0.087128 0.089014 0.127390 0.111640 0.103328 0.107953 0.106810 0.116063 0.135273 0.136701 0.280963
qa: -0.2788 -0.4669 0.0842 -0.1626 -0.1481 -0.1612 0.0808 -0.1506 -0.3298 -0.3052 -0.2967 -0.1145 -0.1546 0.0184 -0.2610 -0.1823 0.4674 0.0289 -0.4180 0.0346 0.0555 0.0792 0.0847 0.0767 0.0584 0.0689 0.0666 0.0252 0.1005 0.0820 0.0830 0.0939 0.0952 0.0824 0.0896 0.0913 0.0807 0.0871 0.0890 0.1274 0.1116 0.1033 0.1080 0.1068 0.1161 0.1353 0.1367 0.2810
va: 2.1246 2.0380 3.7874 3.8929 3.8677 3.8820 3.8115 3.9221 3.9504 3.9276 3.9330 3.8536 3.8998 3.7157 3.9253 3.7684 4.1712 3.9123 3.7206 3.6432 1.0132 1.0073 1.0092 1.0087 1.0046 1.0125 1.0125 1.0186 1.0054 1.0046 0.9977 1.0035 1.0034 1.0032 1.0009 1.0054 1.0031 1.0048 1.0052 1.0017 1.0221 0.9966 0.9959 1.0328 1.0324 0.9891 1.0006 0.9490
dispcorr: -0.019766077 hartree
energy: -853.266931252980
dipole: -36.07029 34.79210 -1.27819 20.84415 -20.21388 0.63026 -5.97392 6.22459 0.25066
magnitude: 1.44701 au
magnitude: 3.67801 debye
