program: Orca
programVersion: 5.0.2
elementType: O O C C C C C C C C C C C C C C C C C C H H H H H H H H H H H H H H H H H H H H H H H H H H H H
charge: 0
multiplicity: 1
keywords: wb97x-d3
keywords: def2-TZVPP
keywords: def2/J RIJCOSX
keywords: DEFGRID2
keywords: scfconv7
keywords: smallprint printgap noloewdin
keywords: NOSOSCF
formula: C18H28O2
InChI: InChI=1/C18H28O2/c1-6-13-20-18(19)14-17(5)12-8-11-16(4)10-7-9-15(2)3/h1,8,12,14-16H,7,9-11,13H2,2-5H3
48 atoms
O  3.85276 -0.414642 0.484745
O  3.364418 -2.378208 -0.459878
C  -4.252309 -0.534527 0.099956
C  -3.679165 0.453518 -0.920991
C  -3.092084 1.736406 -0.34219
C  -2.505397 2.636009 -1.423812
C  -1.929164 3.961942 -0.923168
C  -3.208024 -0.998562 1.127781
C  -5.476039 0.018755 0.821513
C  -0.760299 3.756147 0.034724
C  -1.503333 4.830581 -2.101808
C  -1.977009 -1.565943 0.50929
C  -0.746706 -1.080676 0.710587
C  0.484741 -1.624051 0.146151
C  0.371097 -2.80922 -0.757808
C  1.633751 -0.999371 0.486956
C  2.99295 -1.373613 0.100965
C  5.233086 -0.629592 0.215017
C  5.81648 -1.622012 1.109221
C  6.308977 -2.423889 1.855093
H  -4.572586 -1.41946 -0.462429
H  -2.903637 -0.051953 -1.506809
H  -4.468599 0.709601 -1.635825
H  -3.860098 2.289912 0.208115
H  -2.317211 1.486106 0.386804
H  -3.283485 2.848625 -2.16557
H  -1.719494 2.090274 -1.96055
H  -2.722211 4.492346 -0.381695
H  -3.671226 -1.771028 1.752205
H  -2.945664 -0.176566 1.799219
H  -6.241943 0.340572 0.113109
H  -5.926594 -0.735585 1.469755
H  -5.226669 0.876713 1.449084
H  0.034197 3.169539 -0.434975
H  -1.056561 3.235756 0.946654
H  -0.326143 4.710875 0.338647
H  -2.336081 5.0197 -2.782301
H  -1.124012 5.79938 -1.770722
H  -0.710347 4.348404 -2.679457
H  -2.123624 -2.425515 -0.13932
H  -0.631562 -0.217738 1.361051
H  1.318854 -3.119119 -1.180723
H  -0.31173 -2.58733 -1.580169
H  -0.052715 -3.658794 -0.21824
H  1.564577 -0.125155 1.12432
H  5.713286 0.336827 0.3712
H  5.396102 -0.91381 -0.827133
H  6.746699 -3.137607 2.516474
elementType: O C H
totalener: -853.24697052 hartree
nucrepener: 1484.97953478 hartree
electener: -2338.22650530 hartree
oneelecener: -4104.41438830 hartree
twoeener: 1766.18788301 hartree
cpcmener: -0.02214394 hartree
kineticenergy: 849.14901005 hartree
xcener: -85.608886132832 hartree
chargesum: 0.0000000
charge: -0.279216 -0.466102 0.083741 -0.161244 -0.148231 -0.161098 0.081913 -0.149891 -0.330640 -0.307619 -0.296353 -0.112955 -0.156999 0.019975 -0.261302 -0.182193 0.466773 0.029311 -0.417971 0.033674 0.055925 0.078560 0.084871 0.077234 0.056433 0.069362 0.066167 0.025024 0.100457 0.081770 0.093796 0.095313 0.083289 0.082865 0.090217 0.091867 0.087033 0.088943 0.080655 0.127848 0.111421 0.106429 0.103463 0.107992 0.116103 0.135288 0.136974 0.281129
qa: -0.2792 -0.4661 0.0837 -0.1612 -0.1482 -0.1611 0.0819 -0.1499 -0.3306 -0.3076 -0.2964 -0.1130 -0.1570 0.0200 -0.2613 -0.1822 0.4668 0.0293 -0.4180 0.0337 0.0559 0.0786 0.0849 0.0772 0.0564 0.0694 0.0662 0.0250 0.1005 0.0818 0.0938 0.0953 0.0833 0.0829 0.0902 0.0919 0.0870 0.0889 0.0807 0.1278 0.1114 0.1064 0.1035 0.1080 0.1161 0.1353 0.1370 0.2811
va: 2.1244 2.0381 3.7902 3.8920 3.8682 3.8812 3.8095 3.9220 3.9508 3.9280 3.9325 3.8518 3.8996 3.7125 3.9263 3.7725 4.1686 3.9134 3.7161 3.6448 1.0129 1.0075 1.0092 1.0092 1.0051 1.0124 1.0127 1.0186 1.0056 1.0045 1.0035 1.0033 0.9976 1.0032 1.0006 1.0055 1.0048 1.0054 1.0030 1.0015 1.0219 1.0324 0.9963 0.9960 1.0323 0.9891 0.9999 0.9489
dispcorr: -0.019953100 hartree
energy: -853.266923617153
dipole: -35.49591 34.21270 -1.28321 20.26803 -19.63260 0.63543 -5.85204 6.05879 0.20675
magnitude: 1.44677 au
magnitude: 3.67740 debye
