program: Orca
programVersion: 5.0.2
elementType: O O C C C C C C C C C C C C C C C C C C H H H H H H H H H H H H H H H H H H H H H H H H H H H H
charge: 0
multiplicity: 1
keywords: wb97x-d3
keywords: def2-TZVPP
keywords: def2/J RIJCOSX
keywords: DEFGRID2
keywords: scfconv7
keywords: smallprint printgap noloewdin
keywords: NOSOSCF
formula: C18H28O2
InChI: InChI=1/C18H28O2/c1-6-13-20-18(19)14-17(5)12-8-11-16(4)10-7-9-15(2)3/h1,8,12,14-16H,7,9-11,13H2,2-5H3
48 atoms
O  3.686072 -0.447621 -0.023459
O  3.101083 -2.235019 1.18073
C  -4.316769 -0.29317 -0.400172
C  -3.695027 0.861824 0.386054
C  -2.937558 1.88208 -0.455005
C  -2.343746 3.003397 0.389568
C  -1.555421 4.056814 -0.392094
C  -3.276763 -1.078363 -1.223055
C  -5.105932 -1.21005 0.527969
C  -1.134461 5.19509 0.530537
C  -0.333611 3.464722 -1.087555
C  -2.126041 -1.576852 -0.415263
C  -0.85994 -1.196567 -0.620236
C  0.30057 -1.636994 0.148594
C  0.075555 -2.635193 1.23826
C  1.486714 -1.079864 -0.181137
C  2.79284 -1.349762 0.417266
C  5.027089 -0.57952 0.432994
C  5.727897 -1.663178 -0.243802
C  6.319515 -2.533877 -0.821135
H  -5.021841 0.130899 -1.124429
H  -4.491864 1.373428 0.936998
H  -3.021245 0.454726 1.149415
H  -2.139593 1.381187 -1.007356
H  -3.608953 2.306545 -1.210228
H  -1.687485 2.569612 1.154276
H  -3.152838 3.500633 0.936379
H  -2.217171 4.471958 -1.16233
H  -2.906328 -0.461587 -2.044847
H  -3.784856 -1.932387 -1.684618
H  -5.900414 -0.66047 1.036584
H  -5.575264 -2.028538 -0.021641
H  -4.473805 -1.651347 1.301841
H  -0.467026 4.835675 1.318252
H  -1.99537 5.659164 1.016326
H  -0.604314 5.978281 -0.015289
H  -0.600116 2.715832 -1.834807
H  0.240484 4.2382 -1.601914
H  0.335143 2.9860 -0.366649
H  -2.358523 -2.276361 0.382269
H  -0.655841 -0.492951 -1.422964
H  0.977546 -2.889466 1.781304
H  -0.344099 -3.555594 0.827755
H  -0.653882 -2.250322 1.953321
H  1.493491 -0.337261 -0.971001
H  5.069592 -0.714559 1.516045
H  5.508045 0.371071 0.201672
H  6.845892 -3.313599 -1.325618
elementType: O C H
totalener: -853.24667660 hartree
nucrepener: 1495.76296547 hartree
electener: -2349.00964206 hartree
oneelecener: -4125.94020131 hartree
twoeener: 1776.93055925 hartree
cpcmener: -0.02213457 hartree
kineticenergy: 849.14767967 hartree
xcener: -85.608522903985 hartree
chargesum: -0.0000000
charge: -0.279028 -0.466152 0.079777 -0.176503 -0.117754 -0.159346 0.080813 -0.126852 -0.311014 -0.296651 -0.308335 -0.132714 -0.161290 0.029885 -0.264105 -0.183682 0.465512 0.029887 -0.419261 0.036156 0.042959 0.082056 0.069071 0.045431 0.072069 0.065706 0.069642 0.024940 0.090859 0.099260 0.091712 0.092382 0.080419 0.080361 0.086728 0.089380 0.089137 0.092828 0.083040 0.132118 0.112656 0.107501 0.108408 0.103950 0.115833 0.136137 0.135658 0.280413
qa: -0.2790 -0.4662 0.0798 -0.1765 -0.1178 -0.1593 0.0808 -0.1269 -0.3110 -0.2967 -0.3083 -0.1327 -0.1613 0.0299 -0.2641 -0.1837 0.4655 0.0299 -0.4193 0.0362 0.0430 0.0821 0.0691 0.0454 0.0721 0.0657 0.0696 0.0249 0.0909 0.0993 0.0917 0.0924 0.0804 0.0804 0.0867 0.0894 0.0891 0.0928 0.0830 0.1321 0.1127 0.1075 0.1084 0.1040 0.1158 0.1361 0.1357 0.2804
va: 2.1250 2.0383 3.7914 3.9027 3.8695 3.8837 3.8145 3.8925 3.9513 3.9317 3.9285 3.8449 3.9119 3.6916 3.9249 3.7730 4.1699 3.9129 3.7226 3.6425 1.0171 1.0105 1.0057 1.0138 1.0153 1.0116 1.0126 1.0181 1.0053 1.0057 1.0049 1.0051 1.0009 1.0032 1.0050 1.0052 1.0011 1.0058 1.0027 0.9922 1.0210 1.0328 0.9962 0.9956 1.0327 1.0012 0.9890 0.9493
dispcorr: -0.020274649 hartree
energy: -853.266951244586
dipole: -33.06582 31.81780 -1.24802 19.37023 -18.69561 0.67462 0.03927 -0.50104 -0.46177
magnitude: 1.49195 au
magnitude: 3.79223 debye
