program: Orca
programVersion: 5.0.2
elementType: O O C C C C C C C C C C C C C C C C C C H H H H H H H H H H H H H H H H H H H H H H H H H H H H
charge: 0
multiplicity: 1
keywords: wb97x-d3
keywords: def2-TZVPP
keywords: def2/J RIJCOSX
keywords: DEFGRID2
keywords: scfconv7
keywords: smallprint printgap noloewdin
keywords: NOSOSCF
formula: C18H28O2
InChI: InChI=1/C18H28O2/c1-6-13-20-18(19)14-17(5)12-8-11-16(4)10-7-9-15(2)3/h1,8,12,14-16H,7,9-11,13H2,2-5H3
48 atoms
O  3.304891 -1.323417 1.377819
O  2.944499 -1.343822 -0.825312
C  -4.3238 -0.039443 0.087419
C  -3.431604 1.116859 0.56479
C  -2.344067 1.559454 -0.411707
C  -1.452484 2.646124 0.183807
C  -0.209534 3.019277 -0.633341
C  -3.739287 -1.420502 0.446309
C  -5.724142 0.072781 0.68074
C  0.81962 1.892811 -0.674823
C  -0.558335 3.487904 -2.041543
C  -2.407632 -1.676368 -0.165241
C  -1.261012 -1.758977 0.51853
C  0.061718 -1.818683 -0.093599
C  0.13947 -2.055445 -1.568755
C  1.11914 -1.592368 0.717138
C  2.508375 -1.424877 0.300819
C  4.687875 -1.087967 1.141598
C  4.941806 0.257715 0.641632
C  5.166058 1.371444 0.252657
H  -4.415732 0.016971 -1.004179
H  -4.063042 1.985819 0.779917
H  -2.975269 0.844053 1.524143
H  -1.735347 0.704242 -0.710697
H  -2.820928 1.923762 -1.327247
H  -1.124685 2.32761 1.17998
H  -2.053553 3.54832 0.344357
H  0.257573 3.863909 -0.113826
H  -4.440774 -2.1875 0.100598
H  -3.679639 -1.509593 1.535319
H  -6.364972 -0.751052 0.35964
H  -5.693469 0.058553 1.77328
H  -6.2089 1.002928 0.378766
H  1.739817 2.217795 -1.165409
H  0.453385 1.024446 -1.22673
H  1.087559 1.557999 0.329822
H  0.32352 3.873521 -2.55752
H  -0.957966 2.675825 -2.653291
H  -1.303618 4.286751 -2.027983
H  -2.394027 -1.737633 -1.249805
H  -1.288728 -1.671139 1.601262
H  1.130829 -2.338196 -1.902913
H  -0.149859 -1.153773 -2.114151
H  -0.554521 -2.841757 -1.865025
H  0.932646 -1.46216 1.777156
H  5.106968 -1.830874 0.458658
H  5.173073 -1.221424 2.108713
H  5.368536 2.359064 -0.097255
elementType: O C H
totalener: -853.24253394 hartree
nucrepener: 1564.01286171 hartree
electener: -2417.25539565 hartree
oneelecener: -4262.86582116 hartree
twoeener: 1845.61042552 hartree
cpcmener: -0.02284699 hartree
kineticenergy: 849.14204889 hartree
xcener: -85.608344434366 hartree
chargesum: 0.0000000
charge: -0.279981 -0.468564 0.082016 -0.183412 -0.131270 -0.155423 0.092594 -0.129629 -0.308092 -0.329427 -0.312691 -0.090607 -0.173604 0.021690 -0.269216 -0.204785 0.481926 0.033865 -0.406420 0.018794 0.044312 0.079679 0.068173 0.044536 0.078103 0.070570 0.081110 0.036823 0.090059 0.079719 0.088592 0.087635 0.089535 0.099100 0.067469 0.093499 0.094599 0.080675 0.092020 0.129431 0.112263 0.110077 0.114819 0.111733 0.116485 0.137264 0.135159 0.278797
qa: -0.2800 -0.4686 0.0820 -0.1834 -0.1313 -0.1554 0.0926 -0.1296 -0.3081 -0.3294 -0.3127 -0.0906 -0.1736 0.0217 -0.2692 -0.2048 0.4819 0.0339 -0.4064 0.0188 0.0443 0.0797 0.0682 0.0445 0.0781 0.0706 0.0811 0.0368 0.0901 0.0797 0.0886 0.0876 0.0895 0.0991 0.0675 0.0935 0.0946 0.0807 0.0920 0.1294 0.1123 0.1101 0.1148 0.1117 0.1165 0.1373 0.1352 0.2788
va: 2.1220 2.0214 3.7440 3.9089 3.8594 3.8803 3.8300 3.9428 3.9406 3.9789 3.9416 3.8421 3.8913 3.6802 3.9213 3.7795 4.1253 3.9130 3.6978 3.6664 1.0217 1.0059 1.0102 1.0137 1.0099 1.0114 1.0075 1.0119 1.0081 1.0127 1.0045 0.9999 1.0038 1.0081 0.9936 0.9981 1.0049 0.9969 1.0027 1.0009 1.0229 1.0245 0.9908 0.9986 1.0323 0.9991 0.9893 0.9511
dispcorr: -0.023625694 hartree
energy: -853.266159633990
dipole: -28.37143 27.18071 -1.19072 14.21807 -14.26847 -0.05040 -5.62684 6.13237 0.50553
magnitude: 1.29457 au
magnitude: 3.29054 debye
