program: Orca
programVersion: 5.0.2
elementType: O O C C C C C C C C C C C C C C C C C C H H H H H H H H H H H H H H H H H H H H H H H H H H H H
charge: 0
multiplicity: 1
keywords: wb97x-d3
keywords: def2-TZVPP
keywords: def2/J RIJCOSX
keywords: DEFGRID2
keywords: scfconv7
keywords: smallprint printgap noloewdin
keywords: NOSOSCF
formula: C18H28O2
InChI: InChI=1/C18H28O2/c1-6-13-20-18(19)14-17(5)12-8-11-16(4)10-7-9-15(2)3/h1,8,12,14-16H,7,9-11,13H2,2-5H3
48 atoms
O  3.618522 -0.216373 0.369218
O  3.255173 -2.258526 -0.45741
C  -4.34629 -0.519036 0.063501
C  -3.664506 0.439336 -0.917695
C  -2.99701 1.663964 -0.300598
C  -2.196918 2.450844 -1.33293
C  -1.468663 3.6833 -0.793263
C  -3.374214 -1.095101 1.108822
C  -5.536697 0.120008 0.768803
C  -0.39598 3.315565 0.227565
C  -0.853405 4.477318 -1.940639
C  -2.131085 -1.660907 0.512727
C  -0.908666 -1.177409 0.759671
C  0.340184 -1.666691 0.184955
C  0.27287 -2.855809 -0.717955
C  1.45805 -0.976576 0.501363
C  2.826437 -1.260549 0.073385
C  5.000383 -0.337151 0.052661
C  5.69506 -1.232617 0.968684
C  6.273032 -1.952665 1.736361
H  -4.723204 -1.359931 -0.530133
H  -2.912183 -0.117246 -1.487113
H  -4.406158 0.766978 -1.654245
H  -3.748758 2.31869 0.152326
H  -2.336478 1.353024 0.512498
H  -2.870994 2.762437 -2.138873
H  -1.460035 1.78458 -1.798576
H  -2.206993 4.324924 -0.296682
H  -3.898602 -1.885471 1.657132
H  -3.116145 -0.328694 1.844573
H  -6.253367 0.525323 0.051651
H  -6.067859 -0.607319 1.386421
H  -5.228433 0.936732 1.424799
H  0.337041 2.628365 -0.204601
H  -0.810873 2.836533 1.115633
H  0.146491 4.200566 0.566703
H  -0.350094 5.37742 -1.581644
H  -0.112029 3.880885 -2.479061
H  -1.609713 4.791436 -2.662944
H  -2.261222 -2.49628 -0.170089
H  -0.817579 -0.335562 1.440746
H  1.23488 -3.140989 -1.126243
H  -0.403033 -2.654422 -1.551209
H  -0.136746 -3.714673 -0.182651
H  1.351524 -0.103925 1.135963
H  5.407397 0.670255 0.140622
H  5.146121 -0.66214 -0.979993
H  6.792735 -2.594546 2.412066
elementType: O C H
totalener: -853.24608978 hartree
nucrepener: 1506.44717622 hartree
electener: -2359.69326601 hartree
oneelecener: -4147.35226673 hartree
twoeener: 1787.65900072 hartree
cpcmener: -0.02217438 hartree
kineticenergy: 849.15072115 hartree
xcener: -85.609180969571 hartree
chargesum: -0.0000000
charge: -0.279634 -0.465565 0.078910 -0.156946 -0.155443 -0.161379 0.088261 -0.149027 -0.332137 -0.311516 -0.297323 -0.105093 -0.169618 0.031539 -0.262264 -0.186180 0.465207 0.031248 -0.419196 0.034521 0.057006 0.076256 0.087162 0.079688 0.056563 0.071884 0.065153 0.024394 0.098838 0.080297 0.093581 0.095714 0.084228 0.080335 0.090786 0.094483 0.088875 0.080666 0.087092 0.129296 0.112335 0.106023 0.103923 0.108336 0.116018 0.134949 0.136896 0.280859
qa: -0.2796 -0.4656 0.0789 -0.1569 -0.1554 -0.1614 0.0883 -0.1490 -0.3321 -0.3115 -0.2973 -0.1051 -0.1696 0.0315 -0.2623 -0.1862 0.4652 0.0312 -0.4192 0.0345 0.0570 0.0763 0.0872 0.0797 0.0566 0.0719 0.0652 0.0244 0.0988 0.0803 0.0936 0.0957 0.0842 0.0803 0.0908 0.0945 0.0889 0.0807 0.0871 0.1293 0.1123 0.1060 0.1039 0.1083 0.1160 0.1349 0.1369 0.2809
va: 2.1237 2.0379 3.8014 3.8826 3.8694 3.8797 3.8044 3.9241 3.9520 3.9304 3.9312 3.8431 3.9026 3.6863 3.9272 3.7724 4.1705 3.9122 3.7175 3.6428 1.0123 1.0082 1.0084 1.0104 1.0059 1.0118 1.0134 1.0185 1.0070 1.0051 1.0033 1.0032 0.9971 1.0029 1.0005 1.0063 1.0057 1.0028 1.0050 1.0004 1.0201 1.0321 0.9958 0.9966 1.0324 0.9894 0.9998 0.9491
dispcorr: -0.020788462 hartree
energy: -853.266878246650
dipole: -33.24063 31.92177 -1.31886 18.24808 -17.61766 0.63042 -5.17268 5.31253 0.13984
magnitude: 1.46846 au
magnitude: 3.73253 debye
