program: Orca
programVersion: 5.0.2
elementType: O O C C C C C C C C C C C C C C C C C C H H H H H H H H H H H H H H H H H H H H H H H H H H H H
charge: 0
multiplicity: 1
keywords: wb97x-d3
keywords: def2-TZVPP
keywords: def2/J RIJCOSX
keywords: DEFGRID2
keywords: scfconv7
keywords: smallprint printgap noloewdin
keywords: NOSOSCF
formula: C18H28O2
InChI: InChI=1/C18H28O2/c1-6-13-20-18(19)14-17(5)12-8-11-16(4)10-7-9-15(2)3/h1,8,12,14-16H,7,9-11,13H2,2-5H3
48 atoms
O  3.501535 -1.165424 1.211423
O  3.077996 -2.203722 -0.720299
C  -4.320179 -0.327272 -0.362962
C  -3.408738 0.703417 -1.036788
C  -2.731291 1.706628 -0.109138
C  -1.748551 2.594007 -0.864341
C  -1.017796 3.632622 -0.011754
C  -3.580927 -1.193487 0.674514
C  -5.546373 0.314001 0.275365
C  -0.116777 2.985585 1.036108
C  -0.204459 4.566915 -0.900982
C  -2.312775 -1.771102 0.146895
C  -1.104943 -1.487119 0.646668
C  0.171486 -1.942872 0.106268
C  0.140589 -2.897938 -1.042796
C  1.283841 -1.445357 0.690261
C  2.66924 -1.673283 0.286613
C  4.896965 -1.243066 0.944512
C  5.308252 -0.29358 -0.081672
C  5.659523 0.502945 -0.908637
H  -4.671795 -0.998428 -1.155161
H  -2.634373 0.172952 -1.60148
H  -3.996266 1.2466 -1.785016
H  -3.480386 2.334585 0.384134
H  -2.206201 1.174683 0.688108
H  -2.286811 3.111391 -1.666551
H  -1.002359 1.961847 -1.361757
H  -1.771294 4.23531 0.510444
H  -4.251058 -2.006162 0.97588
H  -3.376894 -0.610403 1.576873
H  -6.103312 0.91149 -0.449339
H  -6.229153 -0.441595 0.66962
H  -5.276144 0.970385 1.105122
H  0.620786 2.328866 0.565804
H  -0.676994 2.386442 1.75572
H  0.431833 3.739172 1.60515
H  -0.834201 5.068636 -1.63878
H  0.296799 5.341448 -0.316903
H  0.567272 4.018255 -1.44748
H  -2.407009 -2.424571 -0.71633
H  -1.045134 -0.821423 1.503652
H  -0.519757 -3.735931 -0.815657
H  1.115448 -3.295712 -1.297678
H  -0.265699 -2.408457 -1.930738
H  1.157596 -0.787668 1.542898
H  5.195145 -2.256869 0.66767
H  5.386768 -1.003122 1.888484
H  5.965072 1.207066 -1.650094
elementType: O C H
totalener: -853.24606365 hartree
nucrepener: 1517.77392296 hartree
electener: -2371.01998661 hartree
oneelecener: -4170.14134617 hartree
twoeener: 1799.12135956 hartree
cpcmener: -0.02225105 hartree
kineticenergy: 849.14887922 hartree
xcener: -85.608823790697 hartree
chargesum: 0.0000000
charge: -0.279830 -0.466603 0.076562 -0.156161 -0.155268 -0.160861 0.086361 -0.145884 -0.331321 -0.310479 -0.297320 -0.107973 -0.169551 0.037746 -0.262489 -0.194667 0.468962 0.029161 -0.418692 0.033969 0.055525 0.077131 0.087711 0.079293 0.057496 0.070758 0.065923 0.024325 0.098409 0.078964 0.094126 0.094891 0.083824 0.081655 0.089825 0.094317 0.086910 0.089031 0.081153 0.129561 0.113749 0.103625 0.105259 0.110882 0.116418 0.136893 0.135297 0.281389
qa: -0.2798 -0.4666 0.0766 -0.1562 -0.1553 -0.1609 0.0864 -0.1459 -0.3313 -0.3105 -0.2973 -0.1080 -0.1696 0.0377 -0.2625 -0.1947 0.4690 0.0292 -0.4187 0.0340 0.0555 0.0771 0.0877 0.0793 0.0575 0.0708 0.0659 0.0243 0.0984 0.0790 0.0941 0.0949 0.0838 0.0817 0.0898 0.0943 0.0869 0.0890 0.0812 0.1296 0.1137 0.1036 0.1053 0.1109 0.1164 0.1369 0.1353 0.2814
va: 2.1232 2.0374 3.8045 3.8816 3.8665 3.8793 3.8056 3.9264 3.9526 3.9301 3.9306 3.8407 3.9008 3.6775 3.9301 3.7753 4.1644 3.9150 3.7170 3.6467 1.0126 1.0078 1.0081 1.0107 1.0065 1.0120 1.0131 1.0188 1.0075 1.0055 1.0031 1.0033 0.9974 1.0022 1.0008 1.0062 1.0050 1.0054 1.0029 1.0006 1.0195 0.9968 1.0289 0.9956 1.0323 1.0001 0.9894 0.9488
dispcorr: -0.020905210 hartree
energy: -853.266968861175
dipole: -30.30762 29.03895 -1.26868 18.31363 -18.12618 0.18745 -2.17128 2.74288 0.57159
magnitude: 1.40407 au
magnitude: 3.56885 debye
