program: Orca
programVersion: 5.0.2
elementType: O O C C C C C C C C C C C C C C C C C C H H H H H H H H H H H H H H H H H H H H H H H H H H H H
charge: 0
multiplicity: 1
keywords: wb97x-d3
keywords: def2-TZVPP
keywords: def2/J RIJCOSX
keywords: DEFGRID2
keywords: scfconv7
keywords: smallprint printgap noloewdin
keywords: NOSOSCF
formula: C18H28O2
InChI: InChI=1/C18H28O2/c1-6-13-20-18(19)14-17(5)12-8-11-16(4)10-7-9-15(2)3/h1,8,12,14-16H,7,9-11,13H2,2-5H3
48 atoms
O  3.44452 -1.492436 1.390694
O  3.084404 -1.445345 -0.811597
C  -4.372436 -0.102975 0.114541
C  -3.616613 1.178203 0.493309
C  -2.526433 1.614392 -0.481973
C  -1.779258 2.85411 0.003816
C  -0.50179 3.200463 -0.769692
C  -3.636872 -1.382446 0.557218
C  -5.770165 -0.101127 0.725475
C  0.592274 2.154828 -0.570978
C  -0.765795 3.433252 -2.253012
C  -2.309717 -1.580758 -0.08591
C  -1.144161 -1.630795 0.568661
C  0.165229 -1.720342 -0.068598
C  0.205846 -1.924646 -1.549777
C  1.24506 -1.575312 0.731758
C  2.642145 -1.50715 0.31222
C  4.842068 -1.365332 1.156669
C  5.207559 -0.023215 0.723503
C  5.527823 1.084076 0.386833
H  -4.481313 -0.134209 -0.976547
H  -4.337652 1.998059 0.583221
H  -3.186318 1.053923 1.494409
H  -1.819346 0.798406 -0.637494
H  -2.981777 1.809964 -1.458063
H  -1.513382 2.71785 1.058108
H  -2.458087 3.713723 -0.022743
H  -0.129843 4.142106 -0.349885
H  -4.271388 -2.238786 0.301853
H  -3.533733 -1.380007 1.646654
H  -5.724734 -0.036787 1.815593
H  -6.355547 0.749197 0.371405
H  -6.322304 -1.008727 0.473183
H  1.533507 2.480029 -1.019226
H  0.333861 1.198972 -1.032143
H  0.782565 1.968774 0.488328
H  -1.069765 2.514321 -2.759325
H  -1.553942 4.172809 -2.411075
H  0.12999 3.797322 -2.760284
H  -2.323719 -1.661672 -1.169141
H  -1.146858 -1.529386 1.65043
H  1.193635 -2.167703 -1.921128
H  -0.13324 -1.023712 -2.065948
H  -0.471459 -2.727989 -1.839883
H  1.077171 -1.460972 1.79652
H  5.194097 -2.104901 0.434126
H  5.317808 -1.58765 2.111799
H  5.818507 2.060526 0.068583
elementType: O C H
totalener: -853.24320508 hartree
nucrepener: 1543.39892458 hartree
electener: -2396.64212966 hartree
oneelecener: -4221.54649675 hartree
twoeener: 1824.90436709 hartree
cpcmener: -0.02256097 hartree
kineticenergy: 849.15097031 hartree
xcener: -85.609885184294 hartree
chargesum: -0.0000000
charge: -0.280542 -0.469024 0.084259 -0.183149 -0.106921 -0.161374 0.080909 -0.128240 -0.305478 -0.309419 -0.310783 -0.099811 -0.158734 0.000933 -0.262896 -0.197547 0.487598 0.031033 -0.416796 0.030941 0.042177 0.076640 0.067685 0.027389 0.075522 0.070673 0.080264 0.036465 0.092941 0.080051 0.086925 0.089314 0.088713 0.099377 0.059225 0.094056 0.080750 0.090896 0.094807 0.130700 0.110953 0.109730 0.111333 0.111009 0.115328 0.136455 0.135533 0.280131
qa: -0.2805 -0.4690 0.0843 -0.1831 -0.1069 -0.1614 0.0809 -0.1282 -0.3055 -0.3094 -0.3108 -0.0998 -0.1587 0.0009 -0.2629 -0.1975 0.4876 0.0310 -0.4168 0.0309 0.0422 0.0766 0.0677 0.0274 0.0755 0.0707 0.0803 0.0365 0.0929 0.0801 0.0869 0.0893 0.0887 0.0994 0.0592 0.0941 0.0807 0.0909 0.0948 0.1307 0.1110 0.1097 0.1113 0.1110 0.1153 0.1365 0.1355 0.2801
va: 2.1257 2.0286 3.7514 3.9213 3.8484 3.8925 3.8335 3.9338 3.9372 3.9578 3.9410 3.8570 3.8928 3.6922 3.9169 3.7691 4.1379 3.9133 3.7140 3.6520 1.0222 1.0062 1.0098 1.0267 1.0102 1.0107 1.0083 1.0122 1.0065 1.0137 1.0002 1.0044 1.0047 1.0074 0.9971 1.0027 0.9973 1.0032 1.0048 1.0011 1.0235 1.0287 0.9913 0.9976 1.0325 1.0000 0.9892 0.9499
dispcorr: -0.022496056 hartree
energy: -853.265701136914
dipole: -30.30824 29.06833 -1.23991 15.02321 -15.09696 -0.07376 -6.02815 6.52344 0.49529
magnitude: 1.33721 au
magnitude: 3.39891 debye
