program: Orca
programVersion: 5.0.2
elementType: O O C C C C C C C C C C C C C C C C C C H H H H H H H H H H H H H H H H H H H H H H H H H H H H
charge: 0
multiplicity: 1
keywords: wb97x-d3
keywords: def2-TZVPP
keywords: def2/J RIJCOSX
keywords: DEFGRID2
keywords: scfconv7
keywords: smallprint printgap noloewdin
keywords: NOSOSCF
formula: C18H28O2
InChI: InChI=1/C18H28O2/c1-6-13-20-18(19)14-17(5)12-8-11-16(4)10-7-9-15(2)3/h1,8,12,14-16H,7,9-11,13H2,2-5H3
48 atoms
O  3.524247 -1.608524 1.39376
O  3.160365 -1.487363 -0.804767
C  -4.395739 -0.15766 0.119553
C  -3.747526 1.199687 0.418944
C  -2.608397 1.611828 -0.508505
C  -2.038796 2.982124 -0.152363
C  -0.728396 3.348836 -0.858766
C  -3.568899 -1.351527 0.631447
C  -5.79083 -0.2209 0.733695
C  0.435088 2.47225 -0.403857
C  -0.86227 3.325034 -2.377582
C  -2.24652 -1.520743 -0.031179
C  -1.070611 -1.564046 0.605345
C  0.229997 -1.651016 -0.050499
C  0.247926 -1.781084 -1.540357
C  1.321413 -1.576546 0.744145
C  2.718813 -1.556907 0.318978
C  4.926268 -1.555891 1.156047
C  5.369283 -0.226763 0.755136
C  5.742267 0.869515 0.438236
H  -4.500348 -0.260269 -0.967744
H  -4.52295 1.972344 0.368827
H  -3.395374 1.202842 1.45766
H  -1.812649 0.867463 -0.47163
H  -2.973371 1.615142 -1.540479
H  -1.870324 3.027319 0.929597
H  -2.789435 3.749948 -0.369692
H  -0.4925 4.378068 -0.565044
H  -4.153388 -2.261433 0.449227
H  -3.444042 -1.272369 1.715893
H  -5.750848 -0.094091 1.818577
H  -6.433801 0.565987 0.335584
H  -6.278179 -1.177039 0.532512
H  1.379155 2.818778 -0.829287
H  0.310008 1.431121 -0.711135
H  0.544146 2.482084 0.682971
H  0.041435 3.705601 -2.858105
H  -1.02357 2.312208 -2.753717
H  -1.697701 3.940412 -2.719029
H  -2.276341 -1.601394 -1.114239
H  -1.057974 -1.471963 1.687845
H  -0.408656 -2.592439 -1.857388
H  1.235251 -1.971143 -1.942487
H  -0.133222 -0.867828 -2.003898
H  1.166288 -1.504577 1.814629
H  5.232806 -2.297102 0.414227
H  5.391273 -1.829095 2.103374
H  6.072214 1.845293 0.1597
elementType: O C H
totalener: -853.24340063 hartree
nucrepener: 1530.90173016 hartree
electener: -2384.14513080 hartree
oneelecener: -4196.49141592 hartree
twoeener: 1812.34628512 hartree
cpcmener: -0.02236170 hartree
kineticenergy: 849.14811425 hartree
xcener: -85.609519808052 hartree
chargesum: -0.0000000
charge: -0.280054 -0.468278 0.087376 -0.184233 -0.074615 -0.168778 0.073170 -0.123292 -0.303031 -0.288123 -0.310383 -0.113887 -0.146378 -0.003309 -0.258012 -0.188269 0.481446 0.030185 -0.417979 0.032117 0.039202 0.074272 0.067361 0.004685 0.073890 0.070222 0.077860 0.037020 0.094389 0.080017 0.086094 0.089269 0.089055 0.097199 0.051112 0.092484 0.094572 0.078941 0.091641 0.130510 0.110233 0.109394 0.111064 0.106182 0.114916 0.136274 0.135561 0.280907
qa: -0.2801 -0.4683 0.0874 -0.1842 -0.0746 -0.1688 0.0732 -0.1233 -0.3030 -0.2881 -0.3104 -0.1139 -0.1464 -0.0033 -0.2580 -0.1883 0.4814 0.0302 -0.4180 0.0321 0.0392 0.0743 0.0674 0.0047 0.0739 0.0702 0.0779 0.0370 0.0944 0.0800 0.0861 0.0893 0.0891 0.0972 0.0511 0.0925 0.0946 0.0789 0.0916 0.1305 0.1102 0.1094 0.1111 0.1062 0.1149 0.1363 0.1356 0.2809
va: 2.1261 2.0331 3.7598 3.9306 3.8263 3.9130 3.8305 3.9231 3.9343 3.9476 3.9429 3.8730 3.8943 3.6972 3.9156 3.7647 4.1554 3.9151 3.7126 3.6470 1.0230 1.0070 1.0098 1.0433 1.0095 1.0101 1.0091 1.0121 1.0051 1.0147 1.0005 1.0048 1.0049 1.0068 1.0001 1.0048 1.0049 0.9976 1.0031 1.0022 1.0234 0.9972 1.0315 0.9927 1.0324 0.9998 0.9890 0.9492
dispcorr: -0.021854326 hartree
energy: -853.265254958273
dipole: -31.47915 30.19920 -1.27995 15.72041 -15.80463 -0.08423 -6.13613 6.64240 0.50628
magnitude: 1.37902 au
magnitude: 3.50519 debye
