program: Orca
programVersion: 5.0.2
elementType: O O C C C C C C C C C C C C C C C C C C H H H H H H H H H H H H H H H H H H H H H H H H H H H H
charge: 0
multiplicity: 1
keywords: wb97x-d3
keywords: def2-TZVPP
keywords: def2/J RIJCOSX
keywords: DEFGRID2
keywords: scfconv7
keywords: smallprint printgap noloewdin
keywords: NOSOSCF
formula: C18H28O2
InChI: InChI=1/C18H28O2/c1-6-13-20-18(19)14-17(5)12-8-11-16(4)10-7-9-15(2)3/h1,8,12,14-16H,7,9-11,13H2,2-5H3
48 atoms
O  3.842609 -0.762745 1.428081
O  3.542474 -1.106825 -0.758329
C  -4.32482 -0.307373 0.174407
C  -4.215252 1.103248 0.762925
C  -2.949075 1.902051 0.46317
C  -2.716445 2.170055 -1.018923
C  -1.413038 2.904901 -1.337662
C  -3.216894 -1.260261 0.653714
C  -5.687928 -0.893875 0.531569
C  -1.200011 2.979239 -2.845161
C  -1.368958 4.300605 -0.724891
C  -1.902285 -1.122487 -0.038076
C  -0.720801 -1.061045 0.586032
C  0.582376 -0.997102 -0.067323
C  0.610987 -0.945491 -1.561204
C  1.664442 -0.977534 0.74278
C  3.070338 -0.957899 0.34505
C  5.251871 -0.759324 1.233031
C  5.775761 -2.100232 1.006423
C  6.21694 -3.204948 0.844303
H  -4.26955 -0.245251 -0.918529
H  -5.078612 1.681283 0.41424
H  -4.331023 1.02631 1.850106
H  -3.027712 2.853243 0.997857
H  -2.075416 1.39756 0.884384
H  -3.56035 2.744932 -1.421528
H  -2.716487 1.221517 -1.565578
H  -0.587888 2.321189 -0.910205
H  -3.560318 -2.285701 0.466779
H  -3.090019 -1.177087 1.737852
H  -5.78952 -1.029972 1.611491
H  -6.500451 -0.241127 0.206762
H  -5.841778 -1.867356 0.061869
H  -1.991502 3.55902 -3.327705
H  -1.198155 1.986193 -3.3005
H  -0.248833 3.454513 -3.09367
H  -2.211094 4.907195 -1.069605
H  -1.404656 4.277197 0.365159
H  -0.452593 4.825325 -1.003435
H  -1.941892 -1.11948 -1.123956
H  -0.708611 -1.068039 1.672593
H  -0.012965 -0.124031 -1.918999
H  0.194105 -1.86258 -1.982084
H  1.606209 -0.812735 -1.967441
H  1.494095 -0.98279 1.813349
H  5.671218 -0.349791 2.151998
H  5.54023 -0.094707 0.415686
H  6.612547 -4.185788 0.703141
elementType: O C H
totalener: -853.24411137 hartree
nucrepener: 1507.46330767 hartree
electener: -2360.70741904 hartree
oneelecener: -4149.29953148 hartree
twoeener: 1788.59211243 hartree
cpcmener: -0.02225118 hartree
kineticenergy: 849.14000109 hartree
xcener: -85.607368878163 hartree
chargesum: -0.0000000
charge: -0.279433 -0.467201 0.082527 -0.223228 -0.111050 -0.182113 0.052647 -0.118197 -0.304167 -0.288528 -0.300987 -0.135368 -0.151711 0.010305 -0.240123 -0.182172 0.466954 0.029900 -0.418451 0.034379 0.048583 0.077341 0.078295 0.087363 0.074792 0.084237 0.070906 0.021818 0.097399 0.084338 0.085998 0.088891 0.089334 0.086946 0.085314 0.091220 0.084300 0.090882 0.090726 0.122558 0.113763 0.081978 0.112751 0.108433 0.115719 0.134598 0.136343 0.281191
qa: -0.2794 -0.4672 0.0825 -0.2232 -0.1110 -0.1821 0.0526 -0.1182 -0.3042 -0.2885 -0.3010 -0.1354 -0.1517 0.0103 -0.2401 -0.1822 0.4670 0.0299 -0.4185 0.0344 0.0486 0.0773 0.0783 0.0874 0.0748 0.0842 0.0709 0.0218 0.0974 0.0843 0.0860 0.0889 0.0893 0.0869 0.0853 0.0912 0.0843 0.0909 0.0907 0.1226 0.1138 0.0820 0.1128 0.1084 0.1157 0.1346 0.1363 0.2812
va: 2.1239 2.0376 3.7321 3.9652 3.8349 3.8545 3.8286 3.8831 3.9344 3.9206 3.9384 3.8630 3.8668 3.7147 3.9238 3.7759 4.1685 3.9138 3.7169 3.6438 1.0165 1.0066 1.0102 1.0096 1.0078 1.0132 1.0071 1.0159 1.0008 1.0147 1.0016 1.0048 1.0045 1.0029 1.0025 1.0054 1.0026 1.0014 1.0042 1.0025 1.0223 0.9972 0.9978 1.0330 1.0324 0.9891 1.0002 0.9489
dispcorr: -0.021472626 hartree
energy: -853.265583997104
dipole: -36.90921 35.62675 -1.28247 17.77771 -17.54246 0.23525 -7.67280 8.20336 0.53056
magnitude: 1.40768 au
magnitude: 3.57803 debye
