program: Orca
programVersion: 5.0.2
elementType: O O C C C C C C C C C C C C C C C C C C H H H H H H H H H H H H H H H H H H H H H H H H H H H H
charge: 0
multiplicity: 1
keywords: wb97x-d3
keywords: def2-TZVPP
keywords: def2/J RIJCOSX
keywords: DEFGRID2
keywords: scfconv7
keywords: smallprint printgap noloewdin
keywords: NOSOSCF
formula: C18H28O2
InChI: InChI=1/C18H28O2/c1-6-13-20-18(19)14-17(5)12-8-11-16(4)10-7-9-15(2)3/h1,8,12,14-16H,7,9-11,13H2,2-5H3
48 atoms
O  3.869984 -0.933513 1.582547
O  3.613001 -0.929439 -0.638747
C  -4.226017 -0.238662 0.261359
C  -3.942054 1.098496 0.954792
C  -2.801866 1.948805 0.39743
C  -3.051378 2.454321 -1.019496
C  -2.024821 3.472646 -1.51857
C  -3.175449 -1.317111 0.572003
C  -5.603561 -0.74879 0.677354
C  -0.634255 2.864007 -1.663883
C  -2.476849 4.084276 -2.840218
C  -1.838402 -1.133944 -0.063933
C  -0.674265 -1.180365 0.589745
C  0.649815 -1.061622 -0.014899
C  0.726787 -0.950458 -1.505104
C  1.705893 -1.06451 0.823173
C  3.124948 -0.973283 0.459462
C  5.27672 -0.868797 1.414094
C  5.860983 -2.167262 1.104393
C  6.369263 -3.22938 0.877706
H  -4.245048 -0.083792 -0.823863
H  -4.856526 1.700968 0.922524
H  -3.758795 0.900598 2.016896
H  -2.67619 2.814198 1.05647
H  -1.861387 1.398768 0.447503
H  -4.047052 2.91139 -1.056773
H  -3.08387 1.61546 -1.725079
H  -1.966471 4.2784 -0.776474
H  -3.571028 -2.277433 0.218623
H  -3.066206 -1.418015 1.656736
H  -5.85045 -1.690525 0.184829
H  -5.650462 -0.918906 1.755512
H  -6.384022 -0.030154 0.425351
H  -0.640957 2.062731 -2.40791
H  -0.261398 2.444681 -0.729097
H  0.090786 3.607768 -1.997295
H  -1.767486 4.831999 -3.198145
H  -2.565364 3.319671 -3.615616
H  -3.449057 4.570412 -2.74457
H  -1.844904 -0.987167 -1.140596
H  -0.69484 -1.315616 1.667602
H  0.257726 -1.819963 -1.969099
H  1.743705 -0.875396 -1.868633
H  0.174662 -0.071752 -1.843444
H  1.512959 -1.144903 1.8864
H  5.667031 -0.507941 2.366435
H  5.550795 -0.147161 0.640742
H  6.811653 -4.1730 0.665218
totalener: -853.22731455 hartree
nucrepener: 1497.40608022 hartree
electener: -2350.63339477 hartree
oneelecener: -4128.89423882 hartree
twoeener: 1778.26084405 hartree
kineticenergy: 849.18251426 hartree
xcener: -85.610774803057 hartree
chargesum: 0.0000000
charge: -0.261992 -0.382823 0.044422 -0.191980 -0.093627 -0.167752 0.065918 -0.118529 -0.271089 -0.300647 -0.261759 -0.123246 -0.098330 0.028619 -0.253631 -0.165598 0.422582 -0.011148 -0.366344 0.069620 0.044750 0.073614 0.074813 0.080780 0.060226 0.071595 0.054502 0.025351 0.090135 0.070256 0.081028 0.082489 0.082682 0.073389 0.092868 0.094808 0.083066 0.075057 0.080066 0.098848 0.074234 0.098704 0.125135 0.073568 0.094817 0.115138 0.125071 0.240343
qa: -0.2620 -0.3828 0.0444 -0.1920 -0.0936 -0.1678 0.0659 -0.1185 -0.2711 -0.3006 -0.2618 -0.1232 -0.0983 0.0286 -0.2536 -0.1656 0.4226 -0.0111 -0.3663 0.0696 0.0447 0.0736 0.0748 0.0808 0.0602 0.0716 0.0545 0.0254 0.0901 0.0703 0.0810 0.0825 0.0827 0.0734 0.0929 0.0948 0.0831 0.0751 0.0801 0.0988 0.0742 0.0987 0.1251 0.0736 0.0948 0.1151 0.1251 0.2403
va: 2.1314 2.1198 3.7779 3.9530 3.8400 3.8750 3.8349 3.9019 3.9416 3.9419 3.9381 3.8880 3.9350 3.6699 3.9138 3.7972 4.2145 3.9858 3.7924 3.6811 1.0175 1.0067 1.0144 1.0125 1.0212 1.0145 1.0157 1.0179 1.0047 1.0193 1.0078 1.0031 1.0080 0.9989 1.0014 1.0121 1.0081 1.0052 1.0079 1.0105 1.0311 1.0004 1.0410 0.9992 1.0363 0.9853 1.0016 0.9742
dispcorr: -0.021131391 hartree
energy: -853.248445940385
dipole: -37.63886 36.76474 -0.87411 17.67799 -17.51044 0.16755 -9.26821 9.63144 0.36323
magnitude: 0.96129 au
magnitude: 2.44342 debye
