program: Orca
programVersion: 5.0.2
elementType: O O C C C C C C C C C C C C C C C C C C H H H H H H H H H H H H H H H H H H H H H H H H H H H H
charge: 0
multiplicity: 1
keywords: wb97x-d3
keywords: def2-TZVPP
keywords: def2/J RIJCOSX
keywords: DEFGRID2
keywords: scfconv7
keywords: smallprint printgap noloewdin
keywords: NOSOSCF
formula: C18H28O2
InChI: InChI=1/C18H28O2/c1-6-13-20-18(19)14-17(5)12-8-11-16(4)10-7-9-15(2)3/h1,8,12,14-16H,7,9-11,13H2,2-5H3
48 atoms
O  3.953494 -2.50392 1.628539
O  3.676933 -2.522076 -0.589988
C  -3.720042 -0.117409 0.028788
C  -2.888113 1.15653 0.179595
C  -3.419751 2.352512 -0.6017
C  -2.498074 3.562996 -0.512446
C  -3.019583 4.82066 -1.209848
C  -3.009775 -1.322449 0.664098
C  -5.116975 0.032274 0.621731
C  -2.091092 6.00049 -0.941353
C  -3.197526 4.614674 -2.710782
C  -1.700884 -1.637313 0.023255
C  -0.534608 -1.716965 0.668312
C  0.757203 -2.017611 0.056355
C  0.795878 -2.202991 -1.428261
C  1.81847 -2.105862 0.882297
C  3.20932 -2.391514 0.510329
C  5.337432 -2.757377 1.451713
C  6.081393 -1.557355 1.092715
C  6.718192 -0.578712 0.820531
H  -3.827363 -0.32539 -1.044051
H  -2.815096 1.412127 1.243704
H  -1.86275 0.956293 -0.147009
H  -3.551892 2.057715 -1.647458
H  -4.412623 2.635614 -0.238322
H  -1.516421 3.305816 -0.928069
H  -2.322708 3.793805 0.544003
H  -4.000677 5.058839 -0.781026
H  -3.664817 -2.196556 0.571441
H  -2.874957 -1.149839 1.736622
H  -5.06529 0.265621 1.687787
H  -5.683574 0.827516 0.138146
H  -5.694093 -0.887419 0.513732
H  -1.095961 5.816299 -1.352821
H  -1.975379 6.184235 0.127984
H  -2.468874 6.917863 -1.395256
H  -2.254553 4.31858 -3.177201
H  -3.934576 3.844655 -2.939007
H  -3.529562 5.532912 -3.197563
H  -1.734301 -1.806015 -1.049833
H  -0.525601 -1.54571 1.741054
H  0.144287 -3.029112 -1.719324
H  1.792078 -2.404407 -1.800982
H  0.416573 -1.308768 -1.926237
H  1.652122 -1.960303 1.943129
H  5.505576 -3.535191 0.702986
H  5.688482 -3.133078 2.413392
H  7.273059 0.291701 0.56618
totalener: -853.23095101 hartree
nucrepener: 1430.80912717 hartree
electener: -2284.04007818 hartree
oneelecener: -3995.71159859 hartree
twoeener: 1711.67152041 hartree
kineticenergy: 849.19030712 hartree
xcener: -85.610201731058 hartree
chargesum: -0.0000000
charge: -0.261854 -0.382378 0.066517 -0.157005 -0.116539 -0.152461 0.056834 -0.122881 -0.290410 -0.266308 -0.278338 -0.132498 -0.088243 0.042118 -0.265247 -0.165110 0.420862 -0.012423 -0.364812 0.069444 0.033511 0.061520 0.079001 0.061465 0.061482 0.063826 0.064593 0.025023 0.090730 0.070316 0.080914 0.087793 0.083553 0.076521 0.080319 0.082080 0.079088 0.082388 0.083798 0.098645 0.073774 0.090499 0.124157 0.090053 0.094931 0.125098 0.115482 0.240169
qa: -0.2619 -0.3824 0.0665 -0.1570 -0.1165 -0.1525 0.0568 -0.1229 -0.2904 -0.2663 -0.2783 -0.1325 -0.0882 0.0421 -0.2652 -0.1651 0.4209 -0.0124 -0.3648 0.0694 0.0335 0.0615 0.0790 0.0615 0.0615 0.0638 0.0646 0.0250 0.0907 0.0703 0.0809 0.0878 0.0836 0.0765 0.0803 0.0821 0.0791 0.0824 0.0838 0.0986 0.0738 0.0905 0.1242 0.0901 0.0949 0.1251 0.1155 0.2402
va: 2.1315 2.1202 3.7963 3.8879 3.8672 3.8989 3.8454 3.9256 3.9544 3.9423 3.9326 3.8982 3.9374 3.6810 3.9226 3.8017 4.2146 3.9861 3.7920 3.6837 1.0213 1.0166 1.0136 1.0106 1.0122 1.0151 1.0141 1.0170 1.0075 1.0177 1.0035 1.0054 1.0075 1.0056 1.0075 1.0075 1.0049 1.0050 1.0076 1.0110 1.0312 0.9969 1.0392 0.9984 1.0361 1.0012 0.9852 0.9744
dispcorr: -0.018318276 hartree
energy: -853.249269284965
dipole: -39.75957 38.86829 -0.89128 28.06714 -27.95234 0.11480 -9.03222 9.36413 0.33192
magnitude: 0.95799 au
magnitude: 2.43501 debye
