program: Orca
programVersion: 5.0.2
elementType: O O C C C C C C C C C C C C C C C C C C H H H H H H H H H H H H H H H H H H H H H H H H H H H H
charge: 0
multiplicity: 1
keywords: wb97x-d3
keywords: def2-TZVPP
keywords: def2/J RIJCOSX
keywords: DEFGRID2
keywords: scfconv7
keywords: smallprint printgap noloewdin
keywords: NOSOSCF
formula: C18H28O2
InChI: InChI=1/C18H28O2/c1-6-13-20-18(19)14-17(5)12-8-11-16(4)10-7-9-15(2)3/h1,8,12,14-16H,7,9-11,13H2,2-5H3
48 atoms
O  3.916891 -2.446124 1.606335
O  3.624302 -2.544792 -0.608188
C  -3.739582 -0.120749 0.019286
C  -2.883559 1.132197 0.206585
C  -3.361771 2.349264 -0.576908
C  -2.405942 3.529876 -0.451756
C  -2.864246 4.809406 -1.153846
C  -3.062898 -1.351661 0.642813
C  -5.141588 0.048131 0.594569
C  -1.900654 5.953022 -0.853366
C  -3.010033 4.619564 -2.66039
C  -1.756677 -1.685551 0.006067
C  -0.590068 -1.760475 0.651251
C  0.702237 -2.062774 0.041114
C  0.737016 -2.280441 -1.439173
C  1.768075 -2.118719 0.864096
C  3.162114 -2.387989 0.490993
C  5.305872 -2.668982 1.426687
C  6.016589 -1.45719 1.040946
C  6.624856 -0.466387 0.748286
H  -3.835027 -0.306822 -1.058652
H  -2.834652 1.375139 1.27503
H  -1.854513 0.910956 -0.093424
H  -3.473992 2.067466 -1.628518
H  -4.355515 2.658586 -0.23772
H  -1.421413 3.24313 -0.840618
H  -2.253614 3.747453 0.611096
H  -3.847037 5.080419 -0.749097
H  -3.736965 -2.209051 0.533672
H  -2.931794 -1.195952 1.718398
H  -5.680063 0.869914 0.123127
H  -5.739831 -0.853477 0.454099
H  -5.101003 0.252886 1.666933
H  -2.231629 6.885847 -1.312305
H  -0.902084 5.734008 -1.238571
H  -1.807617 6.127381 0.219747
H  -3.764206 3.874158 -2.913165
H  -3.30131 5.550961 -3.148251
H  -2.065022 4.297805 -3.105284
H  -1.791261 -1.864372 -1.065276
H  -0.580367 -1.575567 1.721788
H  0.078476 -3.107418 -1.711185
H  1.731087 -2.496788 -1.809077
H  0.363663 -1.394089 -1.955458
H  1.604517 -1.950408 1.922078
H  5.489451 -3.456176 0.691782
H  5.671267 -3.017018 2.39335
H  7.153667 0.414937 0.476321
totalener: -853.23096044 hartree
nucrepener: 1433.75183693 hartree
electener: -2286.98279737 hartree
oneelecener: -4001.59831732 hartree
twoeener: 1714.61551995 hartree
kineticenergy: 849.18828140 hartree
xcener: -85.609783444583 hartree
chargesum: -0.0000000
charge: -0.261707 -0.382803 0.065832 -0.157302 -0.116238 -0.151962 0.056608 -0.121815 -0.288889 -0.266395 -0.278660 -0.127809 -0.094397 0.043618 -0.265296 -0.164654 0.420768 -0.011996 -0.365624 0.069977 0.033095 0.061728 0.079359 0.060512 0.061093 0.063495 0.064671 0.024843 0.090402 0.070445 0.087666 0.083505 0.080460 0.082316 0.076435 0.080452 0.082635 0.084037 0.078935 0.097759 0.074072 0.090477 0.123767 0.090590 0.095079 0.125215 0.115419 0.240285
qa: -0.2617 -0.3828 0.0658 -0.1573 -0.1162 -0.1520 0.0566 -0.1218 -0.2889 -0.2664 -0.2787 -0.1278 -0.0944 0.0436 -0.2653 -0.1647 0.4208 -0.0120 -0.3656 0.0700 0.0331 0.0617 0.0794 0.0605 0.0611 0.0635 0.0647 0.0248 0.0904 0.0704 0.0877 0.0835 0.0805 0.0823 0.0764 0.0805 0.0826 0.0840 0.0789 0.0978 0.0741 0.0905 0.1238 0.0906 0.0951 0.1252 0.1154 0.2403
va: 2.1318 2.1197 3.7954 3.8888 3.8690 3.8985 3.8468 3.9255 3.9537 3.9422 3.9324 3.8945 3.9397 3.6778 3.9230 3.7999 4.2154 3.9849 3.7934 3.6812 1.0214 1.0165 1.0130 1.0110 1.0125 1.0150 1.0140 1.0169 1.0079 1.0179 1.0056 1.0076 1.0036 1.0074 1.0057 1.0074 1.0049 1.0077 1.0049 1.0113 1.0312 0.9969 1.0393 0.9983 1.0360 1.0017 0.9852 0.9742
dispcorr: -0.018346844 hartree
energy: -853.249307280981
dipole: -38.93785 38.05721 -0.88064 27.84532 -27.71224 0.13307 -8.67466 9.00745 0.33279
magnitude: 0.95078 au
magnitude: 2.41670 debye
