program: Orca
programVersion: 5.0.2
elementType: O O C C C C C C C C C C C C C C C C C C H H H H H H H H H H H H H H H H H H H H H H H H H H H H
charge: 0
multiplicity: 1
keywords: wb97x-d3
keywords: def2-TZVPP
keywords: def2/J RIJCOSX
keywords: DEFGRID2
keywords: scfconv7
keywords: smallprint printgap noloewdin
keywords: NOSOSCF
formula: C18H28O2
InChI: InChI=1/C18H28O2/c1-6-13-20-18(19)14-17(5)12-8-11-16(4)10-7-9-15(2)3/h1,8,12,14-16H,7,9-11,13H2,2-5H3
48 atoms
O  4.478668 -2.482035 1.589645
O  3.819242 -3.669559 -0.184955
C  -2.418673 0.71651 -0.318532
C  -3.525293 1.612754 0.241181
C  -3.627289 2.986548 -0.412469
C  -4.684315 3.862295 0.253255
C  -4.887043 5.249387 -0.366131
C  -2.288376 -0.546679 0.551667
C  -2.649509 0.364829 -1.784219
C  -3.627792 6.107918 -0.292788
C  -5.411878 5.175701 -1.796994
C  -1.185975 -1.453711 0.114703
C  0.01241 -1.505707 0.701748
C  1.138393 -2.327228 0.265397
C  0.927078 -3.226298 -0.911991
C  2.291265 -2.196671 0.951156
C  3.563119 -2.877495 0.68285
C  5.791158 -2.995321 1.432716
C  6.518133 -2.336448 0.355299
C  7.135676 -1.783625 -0.510854
H  -1.468645 1.258851 -0.242648
H  -4.48752 1.094177 0.152988
H  -3.356966 1.748292 1.315368
H  -2.649313 3.47564 -0.363558
H  -3.859928 2.875537 -1.474517
H  -4.427309 3.985227 1.31105
H  -5.642627 3.331519 0.239704
H  -5.655806 5.745067 0.237271
H  -3.240554 -1.088275 0.529556
H  -2.125401 -0.243559 1.589488
H  -2.720809 1.255457 -2.4075
H  -1.835751 -0.237085 -2.189505
H  -3.576846 -0.200193 -1.909343
H  -3.238791 6.163413 0.725558
H  -3.829676 7.127939 -0.623045
H  -2.832739 5.715615 -0.929422
H  -6.309515 4.55842 -1.863385
H  -5.667323 6.168098 -2.171359
H  -4.670775 4.756682 -2.480047
H  -1.381724 -2.075331 -0.752706
H  0.189907 -0.877491 1.570464
H  1.800373 -3.820591 -1.148807
H  0.667349 -2.635119 -1.79237
H  0.089249 -3.899497 -0.722438
H  2.312147 -1.50697 1.786576
H  5.778271 -4.075057 1.265251
H  6.291385 -2.807163 2.383223
H  7.672744 -1.299531 -1.290223
totalener: -853.22847444 hartree
nucrepener: 1406.23417261 hartree
electener: -2259.46264705 hartree
oneelecener: -3946.51807753 hartree
twoeener: 1687.05543049 hartree
kineticenergy: 849.19004641 hartree
xcener: -85.611364501425 hartree
chargesum: -0.0000000
charge: -0.262395 -0.381738 0.129268 -0.188730 -0.126066 -0.151390 0.056665 -0.151689 -0.317016 -0.289288 -0.289707 -0.126619 -0.084579 0.033851 -0.265091 -0.165060 0.420323 -0.010771 -0.363221 0.064767 0.042043 0.065079 0.067514 0.067623 0.066788 0.071544 0.070590 0.040389 0.087849 0.074086 0.089839 0.088864 0.082875 0.087028 0.087473 0.074306 0.087072 0.088026 0.072176 0.102590 0.073528 0.123948 0.089927 0.090655 0.094848 0.125964 0.116210 0.239656
qa: -0.2624 -0.3817 0.1293 -0.1887 -0.1261 -0.1514 0.0567 -0.1517 -0.3170 -0.2893 -0.2897 -0.1266 -0.0846 0.0339 -0.2651 -0.1651 0.4203 -0.0108 -0.3632 0.0648 0.0420 0.0651 0.0675 0.0676 0.0668 0.0715 0.0706 0.0404 0.0878 0.0741 0.0898 0.0889 0.0829 0.0870 0.0875 0.0743 0.0871 0.0880 0.0722 0.1026 0.0735 0.1239 0.0899 0.0907 0.0948 0.1260 0.1162 0.2397
va: 2.1308 2.1216 3.7448 3.9444 3.8605 3.9021 3.8467 3.9672 3.9651 3.9478 3.9491 3.8976 3.9422 3.6827 3.9263 3.7980 4.2159 3.9817 3.7864 3.6956 1.0252 1.0124 1.0137 1.0072 1.0064 1.0117 1.0113 1.0095 1.0088 1.0192 1.0071 1.0053 1.0017 1.0048 1.0072 1.0005 1.0050 1.0073 1.0015 1.0023 1.0310 1.0389 0.9988 0.9974 1.0362 1.0004 0.9854 0.9747
dispcorr: -0.018404516 hartree
energy: -853.246878956615
dipole: -45.16800 44.39066 -0.77734 32.81048 -32.21891 0.59156 -8.94763 9.21714 0.26952
magnitude: 1.01333 au
magnitude: 2.57569 debye
